null
SMILES: COc1ccccc1NC(=O)N(Cc1ccco1)Cc1cc2ccc(C)c(C)c2[nH]c1=O
InChI Key: InChIKey=BAHDEIDCOGEAPT-UHFFFAOYSA-N
Activity Spreadsheet -- Enzyme Inhibition Constant Data from BindingDB
Found 1 hit for monomerid = 71652
Trg + Lig
Ki
nM
ΔG°
kcal/mole
IC50
nM
Kd
nM
EC50/IC50
nM
koff
s-1
kon
M-1s-1
pHTemp
°C
Heat shock factor protein 1
(Mus musculus)
BDBM71652
(1-(2-furfuryl)-1-[(2-keto-7,8-dimethyl-1H-quinolin...)
Show SMILES COc1ccccc1NC(=O)N(Cc1ccco1)Cc1cc2ccc(C)c(C)c2[nH]c1=O
Show InChI InChI=1S/C25H25N3O4/c1-16-10-11-18-13-19(24(29)27-23(18)17(16)2)14-28(15-20-7-6-12-32-20)25(30)26-21-8-4-5-9-22(21)31-3/h4-13H,14-15H2,1-3H3,(H,26,30)(H,27,29)
PCBioAssay
n/an/an/an/a>2.60E+5n/an/an/an/a
Broad Institute
Curated by PubChem BioAssay
Assay Description
Keywords: Heat Shock Factor-1 (HSF-1), Stress Response, MG132, NIH3T3, Luminescence Assay Overview: Confirmation testing of small molecules identifie...
PubChem Bioassay (2010)
BindingDB Entry DOI: 10.7270/Q2P55KXK