null
SMILES: NCCc1nnc(SCc2ccc(F)cc2)o1
InChI Key: InChIKey=MEXWLXPWXPJGNT-UHFFFAOYSA-N
Activity Spreadsheet -- Enzyme Inhibition Constant Data from BindingDB
Found 1 hit for monomerid = 71689
Trg + Lig
Ki
nM
ΔG°
kcal/mole
IC50
nM
Kd
nM
EC50/IC50
nM
koff
s-1
kon
M-1s-1
pHTemp
°C
Heat shock factor protein 1
(Mus musculus)
BDBM71689
(2-[5-[(4-fluorobenzyl)thio]-1,3,4-oxadiazol-2-yl]e...)
Show SMILES NCCc1nnc(SCc2ccc(F)cc2)o1
Show InChI InChI=1S/C11H12FN3OS/c12-9-3-1-8(2-4-9)7-17-11-15-14-10(16-11)5-6-13/h1-4H,5-7,13H2
PCBioAssay
n/an/an/an/a>2.60E+5n/an/an/an/a
Broad Institute
Curated by PubChem BioAssay
Assay Description
Keywords: Heat Shock Factor-1 (HSF-1), Stress Response, MG132, NIH3T3, Luminescence Assay Overview: Confirmation testing of small molecules identifie...
PubChem Bioassay (2010)
BindingDB Entry DOI: 10.7270/Q2P55KXK