null
SMILES: Cc1ccc(C)c(NC(=O)CS(=O)(=O)c2cn(C)c3ccccc23)c1
InChI Key: InChIKey=LEOHWPSDAXSDKC-UHFFFAOYSA-N
Activity Spreadsheet -- Enzyme Inhibition Constant Data from BindingDB
Found 1 hit for monomerid = 71755
Trg + Lig
Ki
nM
ΔG°
kcal/mole
IC50
nM
Kd
nM
EC50/IC50
nM
koff
s-1
kon
M-1s-1
pHTemp
°C
Heat shock factor protein 1
(Mus musculus)
BDBM71755
(MLS000086733 | N-(2,5-dimethylphenyl)-2-(1-methyli...)
Show SMILES Cc1ccc(C)c(NC(=O)CS(=O)(=O)c2cn(C)c3ccccc23)c1
Show InChI InChI=1S/C19H20N2O3S/c1-13-8-9-14(2)16(10-13)20-19(22)12-25(23,24)18-11-21(3)17-7-5-4-6-15(17)18/h4-11H,12H2,1-3H3,(H,20,22)
PCBioAssay
n/an/an/an/a>2.60E+5n/an/an/an/a
Broad Institute
Curated by PubChem BioAssay
Assay Description
Keywords: Heat Shock Factor-1 (HSF-1), Stress Response, MG132, NIH3T3, Luminescence Assay Overview: Confirmation testing of small molecules identifie...
PubChem Bioassay (2010)
BindingDB Entry DOI: 10.7270/Q2P55KXK