null
SMILES: CCOC(=O)N1CCC(CC1)NS(=O)(=O)c1ccc2N(C)C(=O)C(C)(C)c2c1
InChI Key: InChIKey=YPSASVMBKADWDT-UHFFFAOYSA-N
Activity Spreadsheet -- Enzyme Inhibition Constant Data from BindingDB
Found 1 hit for monomerid = 71768
Trg + Lig
Ki
nM
ΔG°
kcal/mole
IC50
nM
Kd
nM
EC50/IC50
nM
koff
s-1
kon
M-1s-1
pHTemp
°C
Heat shock factor protein 1
(Mus musculus)
BDBM71768
(4-[(1,3,3-trimethyl-2-oxo-5-indolyl)sulfonylamino]...)
Show SMILES CCOC(=O)N1CCC(CC1)NS(=O)(=O)c1ccc2N(C)C(=O)C(C)(C)c2c1
Show InChI InChI=1S/C19H27N3O5S/c1-5-27-18(24)22-10-8-13(9-11-22)20-28(25,26)14-6-7-16-15(12-14)19(2,3)17(23)21(16)4/h6-7,12-13,20H,5,8-11H2,1-4H3
PCBioAssay
n/an/an/an/a>2.60E+5n/an/an/an/a
Broad Institute
Curated by PubChem BioAssay
Assay Description
Keywords: Heat Shock Factor-1 (HSF-1), Stress Response, MG132, NIH3T3, Luminescence Assay Overview: Confirmation testing of small molecules identifie...
PubChem Bioassay (2010)
BindingDB Entry DOI: 10.7270/Q2P55KXK