null
SMILES: CCOC(=O)N1CCN(CC1)S(=O)(=O)c1cc(Cl)c(OC)cc1Cl
InChI Key: InChIKey=KZGMERQNBPTGCK-UHFFFAOYSA-N
Activity Spreadsheet -- Enzyme Inhibition Constant Data from BindingDB
Found 1 hit for monomerid = 71789
Trg + Lig
Ki
nM
ΔG°
kcal/mole
IC50
nM
Kd
nM
EC50/IC50
nM
koff
s-1
kon
M-1s-1
pHTemp
°C
Heat shock factor protein 1
(Mus musculus)
BDBM71789
(4-(2,5-dichloro-4-methoxy-phenyl)sulfonylpiperazin...)
Show SMILES CCOC(=O)N1CCN(CC1)S(=O)(=O)c1cc(Cl)c(OC)cc1Cl
Show InChI InChI=1S/C14H18Cl2N2O5S/c1-3-23-14(19)17-4-6-18(7-5-17)24(20,21)13-9-10(15)12(22-2)8-11(13)16/h8-9H,3-7H2,1-2H3
PCBioAssay
n/an/an/an/a>2.60E+5n/an/an/an/a
Broad Institute
Curated by PubChem BioAssay
Assay Description
Keywords: Heat Shock Factor-1 (HSF-1), Stress Response, MG132, NIH3T3, Luminescence Assay Overview: Confirmation testing of small molecules identifie...
PubChem Bioassay (2010)
BindingDB Entry DOI: 10.7270/Q2P55KXK