BDBM7391 2-phenyl-1H-indole::2-phenylindole
SMILES: c1c([nH]c2ccccc12)-c1ccccc1
InChI Key: InChIKey=KLLLJCACIRKBDT-UHFFFAOYSA-N
Data: 1 IC50
PDB links: 23 PDB IDs contain this monomer as substructures. 23 PDB IDs contain inhibitors having a similarity of 90% to this monomer.
Activity Spreadsheet -- Enzyme Inhibition Constant Data from BindingDB
Found 1 hit for monomerid = 7391
Trg + Lig
Ki
nM
ΔG°
kcal/mole
IC50
nM
Kd
nM
EC50/IC50
nM
koff
s-1
kon
M-1s-1
pHTemp
°C
Cyclin-Dependent Kinase 1 (CDK1)
(Marthasterias glacialis (starfish))
BDBM7391
(2-phenyl-1H-indole | 2-phenylindole)
Show SMILES c1c([nH]c2ccccc12)-c1ccccc1
Show InChI InChI=1S/C14H11N/c1-2-6-11(7-3-1)14-10-12-8-4-5-9-13(12)15-14/h1-10,15H
n/an/a>1.00E+5n/an/an/an/an/a30
Faculte de Medecine et de Pharmacie
Assay Description
Kinase activities were assayed in buffers containing substrate, enzyme, and inhibitor at 30 °C in the presence of 15 uM ATP/ [gamma-32P] ATP. 32...
J Med Chem 46: 222-36 (2003)
Article DOI: 10.1021/jm020319p
BindingDB Entry DOI: 10.7270/Q2474820