BDBM740 (2S,4R)-N-tert-butyl-1-[(2R,3S)-3-[3-(2,6-dimethylphenyl)propanamido]-2-hydroxy-4-phenylbutyl]-4-(pyridin-4-ylmethoxy)piperidine-2-carboxamide::Palinavir deriv. 12
SMILES: Cc1cccc(C)c1CCC(=O)N[C@@H](Cc1ccccc1)[C@H](O)CN1CC[C@H](C[C@H]1C(=O)NC(C)(C)C)OCc1ccncc1
InChI Key: InChIKey=SNOCIZXDQHKVNO-SBLQOOQRSA-N
Data: 1 IC50
Activity Spreadsheet -- Enzyme Inhibition Constant Data from BindingDB
Found 1 hit for monomerid = 740
Trg + Lig
Ki
nM
ΔG°
kcal/mole
IC50
nM
Kd
nM
EC50/IC50
nM
koff
s-1
kon
M-1s-1
pHTemp
°C
HIV-1 Protease
(Human immunodeficiency virus type 1)
BDBM740
((2S,4R)-N-tert-butyl-1-[(2R,3S)-3-[3-(2,6-dimethyl...)
Show SMILES Cc1cccc(C)c1CCC(=O)N[C@@H](Cc1ccccc1)[C@H](O)CN1CC[C@H](C[C@H]1C(=O)NC(C)(C)C)OCc1ccncc1 |r|
Show InChI InChI=1S/C37H50N4O4/c1-26-10-9-11-27(2)31(26)14-15-35(43)39-32(22-28-12-7-6-8-13-28)34(42)24-41-21-18-30(45-25-29-16-19-38-20-17-29)23-33(41)36(44)40-37(3,4)5/h6-13,16-17,19-20,30,32-34,42H,14-15,18,21-25H2,1-5H3,(H,39,43)(H,40,44)/t30-,32+,33+,34-/m1/s1
n/an/a 2.40E+3n/an/an/an/a5.537
Boehringer Ingelheim Pharmaceuticals Inc.
Assay Description
Sensitivity of HIV-1 protease activity to protease inhibitors was determined by a peptide substrate cleavage assay. Cleavage products and substrate w...
J Med Chem 43: 1094-108 (2000)
Article DOI: 10.1021/jm990336n
BindingDB Entry DOI: 10.7270/Q2BZ647F