BDBM74301 3-[(4-fluorophenyl)sulfamoyl]-N-(2-oxolanylmethyl)benzamide::3-[(4-fluorophenyl)sulfamoyl]-N-(oxolan-2-ylmethyl)benzamide::3-[(4-fluorophenyl)sulfamoyl]-N-(tetrahydrofurfuryl)benzamide::MLS002182434::SMR001271464::cid_25162664
SMILES: Fc1ccc(NS(=O)(=O)c2cccc(c2)C(=O)NCC2CCCO2)cc1
InChI Key: InChIKey=INIVRCKFVCEOOY-UHFFFAOYSA-N
Data: 1 EC50
Activity Spreadsheet -- Enzyme Inhibition Constant Data from BindingDB
Found 1 hit for monomerid = 74301
Trg + Lig
Ki
nM
ΔG°
kcal/mole
IC50
nM
Kd
nM
EC50/IC50
nM
koff
s-1
kon
M-1s-1
pHTemp
°C
LANA
(Human herpesvirus 8)
BDBM74301
(3-[(4-fluorophenyl)sulfamoyl]-N-(2-oxolanylmethyl)...)
Show SMILES Fc1ccc(NS(=O)(=O)c2cccc(c2)C(=O)NCC2CCCO2)cc1
Show InChI InChI=1S/C18H19FN2O4S/c19-14-6-8-15(9-7-14)21-26(23,24)17-5-1-3-13(11-17)18(22)20-12-16-4-2-10-25-16/h1,3,5-9,11,16,21H,2,4,10,12H2,(H,20,22)
PCBioAssay
n/an/an/an/a>7.50E+4n/an/an/an/a
Broad Institute
Curated by PubChem BioAssay
Assay Description
Primary Collaborators: Kenneth Kaye,Brigham & Womens,Boston MA,kkaye@rics.bwh.harvard.edu,617-525-4256 Chantal Beauchemin,Brigham & Womens,Boston MA,...
PubChem Bioassay (2010)
BindingDB Entry DOI: 10.7270/Q2HH6HHN