BDBM74303 1-[4-(5-methyl-3-phenyl-1,2-oxazole-4-carbonyl)piperazin-1-yl]ethanone::1-[4-(5-methyl-3-phenyl-isoxazole-4-carbonyl)piperazino]ethanone::1-[4-[(5-methyl-3-phenyl-1,2-oxazol-4-yl)carbonyl]piperazin-1-yl]ethanone::1-[4-[(5-methyl-3-phenyl-4-isoxazolyl)-oxomethyl]-1-piperazinyl]ethanone::MLS002182943::SMR001271973::cid_25162712
SMILES: CC(=O)N1CCN(CC1)C(=O)c1c(C)onc1-c1ccccc1
InChI Key: InChIKey=BSWCCALTORTFBC-UHFFFAOYSA-N
Data: 1 EC50
Activity Spreadsheet -- Enzyme Inhibition Constant Data from BindingDB
Found 1 hit for monomerid = 74303
Trg + Lig
Ki
nM
ΔG°
kcal/mole
IC50
nM
Kd
nM
EC50/IC50
nM
koff
s-1
kon
M-1s-1
pHTemp
°C
LANA
(Human herpesvirus 8)
BDBM74303
(1-[4-(5-methyl-3-phenyl-1,2-oxazole-4-carbonyl)pip...)
Show SMILES CC(=O)N1CCN(CC1)C(=O)c1c(C)onc1-c1ccccc1
Show InChI InChI=1S/C17H19N3O3/c1-12-15(16(18-23-12)14-6-4-3-5-7-14)17(22)20-10-8-19(9-11-20)13(2)21/h3-7H,8-11H2,1-2H3
PCBioAssay
n/an/an/an/a>7.50E+4n/an/an/an/a
Broad Institute
Curated by PubChem BioAssay
Assay Description
Primary Collaborators: Kenneth Kaye,Brigham & Womens,Boston MA,kkaye@rics.bwh.harvard.edu,617-525-4256 Chantal Beauchemin,Brigham & Womens,Boston MA,...
PubChem Bioassay (2010)
BindingDB Entry DOI: 10.7270/Q2HH6HHN