BDBM74306 MLS002182970::N-[[5-(2-chlorophenyl)-1,3,4-oxadiazol-2-yl]methyl]-N-cyclopropyl-2-(3-oxidanylidene-1H-2-benzofuran-1-yl)ethanamide::N-[[5-(2-chlorophenyl)-1,3,4-oxadiazol-2-yl]methyl]-N-cyclopropyl-2-(3-oxo-1H-2-benzofuran-1-yl)acetamide::N-[[5-(2-chlorophenyl)-1,3,4-oxadiazol-2-yl]methyl]-N-cyclopropyl-2-(3-oxo-1H-isobenzofuran-1-yl)acetamide::N-[[5-(2-chlorophenyl)-1,3,4-oxadiazol-2-yl]methyl]-N-cyclopropyl-2-phthalidyl-acetamide::SMR001272000::cid_25162717
SMILES: Clc1ccccc1-c1nnc(CN(C2CC2)C(=O)CC2OC(=O)c3ccccc23)o1
InChI Key: InChIKey=SWCHNZDOHCRWGT-UHFFFAOYSA-N
Data: 1 EC50
Activity Spreadsheet -- Enzyme Inhibition Constant Data from BindingDB
Found 1 hit for monomerid = 74306
Trg + Lig
Ki
nM
ΔG°
kcal/mole
IC50
nM
Kd
nM
EC50/IC50
nM
koff
s-1
kon
M-1s-1
pHTemp
°C
LANA
(Human herpesvirus 8)
BDBM74306
(MLS002182970 | N-[[5-(2-chlorophenyl)-1,3,4-oxadia...)
Show SMILES Clc1ccccc1-c1nnc(CN(C2CC2)C(=O)CC2OC(=O)c3ccccc23)o1
Show InChI InChI=1S/C22H18ClN3O4/c23-17-8-4-3-7-16(17)21-25-24-19(30-21)12-26(13-9-10-13)20(27)11-18-14-5-1-2-6-15(14)22(28)29-18/h1-8,13,18H,9-12H2
PCBioAssay
n/an/an/an/a>7.50E+4n/an/an/an/a
Broad Institute
Curated by PubChem BioAssay
Assay Description
Primary Collaborators: Kenneth Kaye,Brigham & Womens,Boston MA,kkaye@rics.bwh.harvard.edu,617-525-4256 Chantal Beauchemin,Brigham & Womens,Boston MA,...
PubChem Bioassay (2010)
BindingDB Entry DOI: 10.7270/Q2HH6HHN