BDBM74310 5-chloro-2-methoxy-benzoic acid [2-[(6-amino-1-benzyl-2,4-diketo-pyrimidin-5-yl)-ethyl-amino]-2-keto-ethyl] ester::5-chloro-2-methoxybenzoic acid [2-[[6-amino-2,4-dioxo-1-(phenylmethyl)-5-pyrimidinyl]-ethylamino]-2-oxoethyl] ester::MLS002180743::SMR001269773::[2-[(6-amino-1-benzyl-2,4-dioxopyrimidin-5-yl)-ethylamino]-2-oxoethyl] 5-chloro-2-methoxybenzoate::[2-[[6-azanyl-2,4-bis(oxidanylidene)-1-(phenylmethyl)pyrimidin-5-yl]-ethyl-amino]-2-oxidanylidene-ethyl] 5-chloranyl-2-methoxy-benzoate::cid_25162841
SMILES: CCN(C(=O)COC(=O)c1cc(Cl)ccc1OC)c1c(N)n(Cc2ccccc2)c(=O)[nH]c1=O
InChI Key: InChIKey=DSIZEXZYJJBKCV-UHFFFAOYSA-N
Data: 1 EC50
Activity Spreadsheet -- Enzyme Inhibition Constant Data from BindingDB
Found 1 hit for monomerid = 74310
Trg + Lig
Ki
nM
ΔG°
kcal/mole
IC50
nM
Kd
nM
EC50/IC50
nM
koff
s-1
kon
M-1s-1
pHTemp
°C
LANA
(Human herpesvirus 8)
BDBM74310
(5-chloro-2-methoxy-benzoic acid [2-[(6-amino-1-ben...)
Show SMILES CCN(C(=O)COC(=O)c1cc(Cl)ccc1OC)c1c(N)n(Cc2ccccc2)c(=O)[nH]c1=O
Show InChI InChI=1S/C23H23ClN4O6/c1-3-27(18(29)13-34-22(31)16-11-15(24)9-10-17(16)33-2)19-20(25)28(23(32)26-21(19)30)12-14-7-5-4-6-8-14/h4-11H,3,12-13,25H2,1-2H3,(H,26,30,32)
PCBioAssay
n/an/an/an/a>7.50E+4n/an/an/an/a
Broad Institute
Curated by PubChem BioAssay
Assay Description
Primary Collaborators: Kenneth Kaye,Brigham & Womens,Boston MA,kkaye@rics.bwh.harvard.edu,617-525-4256 Chantal Beauchemin,Brigham & Womens,Boston MA,...
PubChem Bioassay (2010)
BindingDB Entry DOI: 10.7270/Q2HH6HHN