BDBM74314 2-[[4-[(2-keto-1,3-dihydrobenzimidazol-5-yl)sulfonylamino]benzoyl]amino]-3-phenyl-propionic acid methyl ester::2-[[oxo-[4-[(2-oxo-1,3-dihydrobenzimidazol-5-yl)sulfonylamino]phenyl]methyl]amino]-3-phenylpropanoic acid methyl ester::MLS002171691::SMR001251983::cid_16298180::methyl 2-[[4-[(2-oxidanylidene-1,3-dihydrobenzimidazol-5-yl)sulfonylamino]phenyl]carbonylamino]-3-phenyl-propanoate::methyl 2-[[4-[(2-oxo-1,3-dihydrobenzimidazol-5-yl)sulfonylamino]benzoyl]amino]-3-phenylpropanoate
SMILES: COC(=O)C(Cc1ccccc1)NC(=O)c1ccc(NS(=O)(=O)c2ccc3[nH]c(=O)[nH]c3c2)cc1
InChI Key: InChIKey=YYMRNCHEYQOSKV-UHFFFAOYSA-N
Data: 1 EC50
Activity Spreadsheet -- Enzyme Inhibition Constant Data from BindingDB
Found 1 hit for monomerid = 74314
Trg + Lig
Ki
nM
ΔG°
kcal/mole
IC50
nM
Kd
nM
EC50/IC50
nM
koff
s-1
kon
M-1s-1
pHTemp
°C
LANA
(Human herpesvirus 8)
BDBM74314
(2-[[4-[(2-keto-1,3-dihydrobenzimidazol-5-yl)sulfon...)
Show SMILES COC(=O)C(Cc1ccccc1)NC(=O)c1ccc(NS(=O)(=O)c2ccc3[nH]c(=O)[nH]c3c2)cc1
Show InChI InChI=1S/C24H20N4O6S/c1-34-23(30)21(13-15-5-3-2-4-6-15)25-22(29)16-7-9-17(10-8-16)28-35(32,33)18-11-12-19-20(14-18)27-24(31)26-19/h2-12,14,21,28H,13H2,1H3,(H,25,29)
PCBioAssay
n/an/an/an/a>7.50E+4n/an/an/an/a
Broad Institute
Curated by PubChem BioAssay
Assay Description
Primary Collaborators: Kenneth Kaye,Brigham & Womens,Boston MA,kkaye@rics.bwh.harvard.edu,617-525-4256 Chantal Beauchemin,Brigham & Womens,Boston MA,...
PubChem Bioassay (2010)
BindingDB Entry DOI: 10.7270/Q2HH6HHN