BDBM74318 MLS002158333::N-(6-amino-1-butyl-2,4-diketo-pyrimidin-5-yl)-N-isoamyl-2-naphthamide::N-(6-amino-1-butyl-2,4-dioxo-5-pyrimidinyl)-N-(3-methylbutyl)-2-naphthalenecarboxamide::N-(6-amino-1-butyl-2,4-dioxopyrimidin-5-yl)-N-(3-methylbutyl)naphthalene-2-carboxamide::N-[6-azanyl-1-butyl-2,4-bis(oxidanylidene)pyrimidin-5-yl]-N-(3-methylbutyl)naphthalene-2-carboxamide::SMR001240807::cid_8147403
SMILES: CCCCn1c(N)c(N(CCC(C)C)C(=O)c2ccc3ccccc3c2)c(=O)[nH]c1=O
InChI Key: InChIKey=WETNKTIKKABIOP-UHFFFAOYSA-N
Data: 1 EC50
Activity Spreadsheet -- Enzyme Inhibition Constant Data from BindingDB
Found 1 hit for monomerid = 74318
Trg + Lig
Ki
nM
ΔG°
kcal/mole
IC50
nM
Kd
nM
EC50/IC50
nM
koff
s-1
kon
M-1s-1
pHTemp
°C
LANA
(Human herpesvirus 8)
BDBM74318
(MLS002158333 | N-(6-amino-1-butyl-2,4-diketo-pyrim...)
Show SMILES CCCCn1c(N)c(N(CCC(C)C)C(=O)c2ccc3ccccc3c2)c(=O)[nH]c1=O
Show InChI InChI=1S/C24H30N4O3/c1-4-5-13-28-21(25)20(22(29)26-24(28)31)27(14-12-16(2)3)23(30)19-11-10-17-8-6-7-9-18(17)15-19/h6-11,15-16H,4-5,12-14,25H2,1-3H3,(H,26,29,31)
PCBioAssay
n/an/an/an/a>7.50E+4n/an/an/an/a
Broad Institute
Curated by PubChem BioAssay
Assay Description
Primary Collaborators: Kenneth Kaye,Brigham & Womens,Boston MA,kkaye@rics.bwh.harvard.edu,617-525-4256 Chantal Beauchemin,Brigham & Womens,Boston MA,...
PubChem Bioassay (2010)
BindingDB Entry DOI: 10.7270/Q2HH6HHN