null
SMILES: CNS(=O)(=O)c1cc(OC)c(OC)cc1CC(=O)OC
InChI Key: InChIKey=UUYYUGFFUCWYKB-UHFFFAOYSA-N
Activity Spreadsheet -- Enzyme Inhibition Constant Data from BindingDB
Found 1 hit for monomerid = 75034
Trg + Lig
Ki
nM
ΔG°
kcal/mole
IC50
nM
Kd
nM
EC50/IC50
nM
koff
s-1
kon
M-1s-1
pHTemp
°C
Importin subunit alpha-1
(Homo sapiens (Human))
BDBM75034
(2-[4,5-dimethoxy-2-(methylsulfamoyl)phenyl]acetic ...)
Show SMILES CNS(=O)(=O)c1cc(OC)c(OC)cc1CC(=O)OC
Show InChI InChI=1S/C12H17NO6S/c1-13-20(15,16)11-7-10(18-3)9(17-2)5-8(11)6-12(14)19-4/h5,7,13H,6H2,1-4H3
Reactome pathway
PCBioAssay
n/an/an/an/a>5.00E+5n/an/an/an/a
Broad Institute
Curated by PubChem BioAssay
Assay Description
Keywords: Counterscreen, FRET assay, HTS, YIC probe, Dose response, Assay Overview: This is a fluorescence resonance energy transfer (FRET)-based b...
PubChem Bioassay (2010)
BindingDB Entry DOI: 10.7270/Q280513R