null
SMILES: COc1ccc(cc1)C(=O)NNCc1c(O)c(C)ncc1C=O
InChI Key: InChIKey=NVQOUJHMKPSSLJ-UHFFFAOYSA-N
Activity Spreadsheet -- Enzyme Inhibition Constant Data from BindingDB
Found 1 hit for monomerid = 75040
Trg + Lig
Ki
nM
ΔG°
kcal/mole
IC50
nM
Kd
nM
EC50/IC50
nM
koff
s-1
kon
M-1s-1
pHTemp
°C
Importin subunit alpha-1
(Homo sapiens (Human))
BDBM75040
(MLS000673318 | N'-{(1E)-[3-hydroxy-5-(hydroxym...)
Show SMILES COc1ccc(cc1)C(=O)NNCc1c(O)c(C)ncc1C=O
Show InChI InChI=1S/C16H17N3O4/c1-10-15(21)14(12(9-20)7-17-10)8-18-19-16(22)11-3-5-13(23-2)6-4-11/h3-7,9,18,21H,8H2,1-2H3,(H,19,22)
Reactome pathway
PCBioAssay
n/an/an/an/a 1.52E+3n/an/an/an/a
Broad Institute
Curated by PubChem BioAssay
Assay Description
Keywords: Counterscreen, FRET assay, HTS, YIC probe, Dose response, Assay Overview: This is a fluorescence resonance energy transfer (FRET)-based b...
PubChem Bioassay (2010)
BindingDB Entry DOI: 10.7270/Q280513R