BDBM7558 1-{2-[6-(benzylamino)-9-(propan-2-yl)-9H-purin-2-yl]ethynyl}cyclopentan-1-ol::C-2 alkynylated purine deriv. 2f::CHEMBL336776
SMILES: CC(C)n1cnc2c(NCc3ccccc3)nc(nc12)C#CC1(O)CCCC1
InChI Key: InChIKey=ZHSGNFYFDBVFAE-UHFFFAOYSA-N
Data: 2 IC50
Activity Spreadsheet -- Enzyme Inhibition Constant Data from BindingDB
Found 2 hits for monomerid = 7558
Trg + Lig
Ki
nM
ΔG°
kcal/mole
IC50
nM
Kd
nM
EC50/IC50
nM
koff
s-1
kon
M-1s-1
pHTemp
°C
Cyclin-dependent kinase 1
(Homo sapiens (Human))
BDBM7558
(1-{2-[6-(benzylamino)-9-(propan-2-yl)-9H-purin-2-y...)
Show SMILES CC(C)n1cnc2c(NCc3ccccc3)nc(nc12)C#CC1(O)CCCC1
Show InChI InChI=1S/C22H25N5O/c1-16(2)27-15-24-19-20(23-14-17-8-4-3-5-9-17)25-18(26-21(19)27)10-13-22(28)11-6-7-12-22/h3-5,8-9,15-16,28H,6-7,11-12,14H2,1-2H3,(H,23,25,26)
Reactome pathway
n/an/a 500n/an/an/an/an/an/a
Institut Curie
Curated by ChEMBL
Assay Description
Inhibition of Cyclin-dependent kinase 1 (CDK1)
J Med Chem 43: 4098-108 (2000)
BindingDB Entry DOI: 10.7270/Q24B321Q
Cyclin-Dependent Kinase 1 (CDK1)
(Marthasterias glacialis (starfish))
BDBM7558
(1-{2-[6-(benzylamino)-9-(propan-2-yl)-9H-purin-2-y...)
Show SMILES CC(C)n1cnc2c(NCc3ccccc3)nc(nc12)C#CC1(O)CCCC1
Show InChI InChI=1S/C22H25N5O/c1-16(2)27-15-24-19-20(23-14-17-8-4-3-5-9-17)25-18(26-21(19)27)10-13-22(28)11-6-7-12-22/h3-5,8-9,15-16,28H,6-7,11-12,14H2,1-2H3,(H,23,25,26)
n/an/a 500n/an/an/an/a7.230
Institut Curie
Assay Description
Kinase activities were assayed in buffers containing substrate, enzyme, and inhibitor at 30 °C in the presence of 15 uM ATP/ [gamma-32P] ATP. 32...
Bioorg Med Chem Lett 8: 793-8 (1998)
Article DOI: 10.1016/s0960-894x(98)00097-3
BindingDB Entry DOI: 10.7270/Q2TQ5ZRN