BDBM758 CHEMBL277034::Hydroxyethylene deriv. 9::tert-butyl N-[(2S,3S,5R)-5-benzyl-5-(benzylcarbamoyl)-3-hydroxy-1-phenylpentan-2-yl]carbamate
SMILES: CC(C)(C)OC(=O)N[C@@H](Cc1ccccc1)[C@@H](O)C[C@@H](Cc1ccccc1)C(=O)NCc1ccccc1
InChI Key: InChIKey=SDOJFPSFHFRQPP-PKTNWEFCSA-N
Data: 6 IC50
Activity Spreadsheet -- Enzyme Inhibition Constant Data from BindingDB
Found 6 hits for monomerid = 758
Trg + Lig
Ki
nM
ΔG°
kcal/mole
IC50
nM
Kd
nM
EC50/IC50
nM
koff
s-1
kon
M-1s-1
pHTemp
°C
HIV-1 Protease
(Human immunodeficiency virus type 1)
BDBM758
(CHEMBL277034 | Hydroxyethylene deriv. 9 | tert-but...)
Show SMILES CC(C)(C)OC(=O)N[C@@H](Cc1ccccc1)[C@@H](O)C[C@@H](Cc1ccccc1)C(=O)NCc1ccccc1 |r|
Show InChI InChI=1S/C31H38N2O4/c1-31(2,3)37-30(36)33-27(20-24-15-9-5-10-16-24)28(34)21-26(19-23-13-7-4-8-14-23)29(35)32-22-25-17-11-6-12-18-25/h4-18,26-28,34H,19-22H2,1-3H3,(H,32,35)(H,33,36)/t26-,27+,28+/m1/s1
n/an/a 111n/an/an/an/a5.530
Merck Research Laboratories
Assay Description
Sensitivity of HIV-1 protease activity to protease inhibitors was determined by a peptide substrate cleavage assay. Protease products were analyzed o...
J Med Chem 34: 1225-8 (1991)
Article DOI: 10.1021/jm00107a050
BindingDB Entry DOI: 10.7270/Q2765CH1
HIV-1 Protease
(Human immunodeficiency virus type 1)
BDBM758
(CHEMBL277034 | Hydroxyethylene deriv. 9 | tert-but...)
Show SMILES CC(C)(C)OC(=O)N[C@@H](Cc1ccccc1)[C@@H](O)C[C@@H](Cc1ccccc1)C(=O)NCc1ccccc1 |r|
Show InChI InChI=1S/C31H38N2O4/c1-31(2,3)37-30(36)33-27(20-24-15-9-5-10-16-24)28(34)21-26(19-23-13-7-4-8-14-23)29(35)32-22-25-17-11-6-12-18-25/h4-18,26-28,34H,19-22H2,1-3H3,(H,32,35)(H,33,36)/t26-,27+,28+/m1/s1
n/an/a 111n/an/an/an/a5.530
Merck Sharp and Dohme Research Laboratories
Assay Description
Sensitivity of HIV-1 protease activity to protease inhibitors was determined by a peptide substrate cleavage assay. Protease products were analyzed o...
J Med Chem 34: 1228-30 (1991)
Article DOI: 10.1021/jm00107a051
BindingDB Entry DOI: 10.7270/Q2XS5SKZ
Human immunodeficiency virus type 1 protease
(Human immunodeficiency virus type 1)
BDBM758
(CHEMBL277034 | Hydroxyethylene deriv. 9 | tert-but...)
Show SMILES CC(C)(C)OC(=O)N[C@@H](Cc1ccccc1)[C@@H](O)C[C@@H](Cc1ccccc1)C(=O)NCc1ccccc1 |r|
Show InChI InChI=1S/C31H38N2O4/c1-31(2,3)37-30(36)33-27(20-24-15-9-5-10-16-24)28(34)21-26(19-23-13-7-4-8-14-23)29(35)32-22-25-17-11-6-12-18-25/h4-18,26-28,34H,19-22H2,1-3H3,(H,32,35)(H,33,36)/t26-,27+,28+/m1/s1
n/an/a 115n/an/an/an/an/an/a
University of Missouri-St. Louis
Curated by ChEMBL
Assay Description
Inhibition of human immunodeficiency virus type 1 (HIV-1) protease enzyme.
J Med Chem 43: 4446-51 (2000)
BindingDB Entry DOI: 10.7270/Q2S75HMB
Human immunodeficiency virus type 1 protease
(Human immunodeficiency virus type 1)
BDBM758
(CHEMBL277034 | Hydroxyethylene deriv. 9 | tert-but...)
Show SMILES CC(C)(C)OC(=O)N[C@@H](Cc1ccccc1)[C@@H](O)C[C@@H](Cc1ccccc1)C(=O)NCc1ccccc1 |r|
Show InChI InChI=1S/C31H38N2O4/c1-31(2,3)37-30(36)33-27(20-24-15-9-5-10-16-24)28(34)21-26(19-23-13-7-4-8-14-23)29(35)32-22-25-17-11-6-12-18-25/h4-18,26-28,34H,19-22H2,1-3H3,(H,32,35)(H,33,36)/t26-,27+,28+/m1/s1
n/an/a 114n/an/an/an/an/an/a
Eli Lilly and Company
Curated by ChEMBL
Assay Description
Inhibitory activity against HIV-1 protease.
J Med Chem 43: 3020-32 (2000)
BindingDB Entry DOI: 10.7270/Q2HM59P2
Human immunodeficiency virus type 1 protease
(Human immunodeficiency virus type 1)
BDBM758
(CHEMBL277034 | Hydroxyethylene deriv. 9 | tert-but...)
Show SMILES CC(C)(C)OC(=O)N[C@@H](Cc1ccccc1)[C@@H](O)C[C@@H](Cc1ccccc1)C(=O)NCc1ccccc1 |r|
Show InChI InChI=1S/C31H38N2O4/c1-31(2,3)37-30(36)33-27(20-24-15-9-5-10-16-24)28(34)21-26(19-23-13-7-4-8-14-23)29(35)32-22-25-17-11-6-12-18-25/h4-18,26-28,34H,19-22H2,1-3H3,(H,32,35)(H,33,36)/t26-,27+,28+/m1/s1
n/an/a 115n/an/an/an/an/an/a
Universidad de Alcal£
Curated by ChEMBL
Assay Description
Inhibitory activity against HIV-1 protease.
J Med Chem 41: 836-52 (1998)
Article DOI: 10.1021/jm970535b
BindingDB Entry DOI: 10.7270/Q21R6RTN
Human immunodeficiency virus type 1 protease
(Human immunodeficiency virus type 1)
BDBM758
(CHEMBL277034 | Hydroxyethylene deriv. 9 | tert-but...)
Show SMILES CC(C)(C)OC(=O)N[C@@H](Cc1ccccc1)[C@@H](O)C[C@@H](Cc1ccccc1)C(=O)NCc1ccccc1 |r|
Show InChI InChI=1S/C31H38N2O4/c1-31(2,3)37-30(36)33-27(20-24-15-9-5-10-16-24)28(34)21-26(19-23-13-7-4-8-14-23)29(35)32-22-25-17-11-6-12-18-25/h4-18,26-28,34H,19-22H2,1-3H3,(H,32,35)(H,33,36)/t26-,27+,28+/m1/s1
n/an/a 114n/an/an/an/an/an/a
Merck Research Laboratories
Curated by ChEMBL
Assay Description
In vitro inhibition of HIV-1 protease
J Med Chem 38: 305-17 (1995)
Checked by Author
BindingDB Entry DOI: 10.7270/Q23T9G8M