BDBM7668 4-[(4-{6-cyanoimidazo[1,2-a]pyridin-3-yl}pyrimidin-2-yl)amino]-N-(2-methoxyethyl)benzene-1-sulfonamide::Imidazo[1,2-a]pyridine deriv. 4e
SMILES: COCCNS(=O)(=O)c1ccc(Nc2nccc(n2)-c2cnc3ccc(cn23)C#N)cc1
InChI Key: InChIKey=OQUMUPWXLNHMSI-UHFFFAOYSA-N
Data: 1 IC50
Activity Spreadsheet -- Enzyme Inhibition Constant Data from BindingDB
Found 1 hit for monomerid = 7668
Trg + Lig
Ki
nM
ΔG°
kcal/mole
IC50
nM
Kd
nM
EC50/IC50
nM
koff
s-1
kon
M-1s-1
pHTemp
°C
CDK2/CycE
(Homo sapiens (Human))
BDBM7668
(4-[(4-{6-cyanoimidazo[1,2-a]pyridin-3-yl}pyrimidin...)
Show SMILES COCCNS(=O)(=O)c1ccc(Nc2nccc(n2)-c2cnc3ccc(cn23)C#N)cc1
Show InChI InChI=1S/C21H19N7O3S/c1-31-11-10-25-32(29,30)17-5-3-16(4-6-17)26-21-23-9-8-18(27-21)19-13-24-20-7-2-15(12-22)14-28(19)20/h2-9,13-14,25H,10-11H2,1H3,(H,23,26,27)
n/an/a<3n/an/an/an/a7.022
AstraZeneca
Assay Description
The kinase activity was assayed using an in vitro scintillation proximity assay (SPA) for measuring incorporation of [gamma-33P] ATP into GST-Rb.
Bioorg Med Chem Lett 14: 2249-52 (2004)
Article DOI: 10.1016/j.bmcl.2004.02.008
BindingDB Entry DOI: 10.7270/Q2XG9PCF