BDBM7670 Imidazo[1,2-a]pyridine deriv. 4g::N-(2-methoxyethyl)-4-({4-[6-(phenylsulfanyl)imidazo[1,2-a]pyridin-3-yl]pyrimidin-2-yl}amino)benzene-1-sulfonamide
SMILES: COCCNS(=O)(=O)c1ccc(Nc2nccc(n2)-c2cnc3ccc(Sc4ccccc4)cn23)cc1
InChI Key: InChIKey=AKKYFIFRTKACRF-UHFFFAOYSA-N
Data: 1 IC50
Activity Spreadsheet -- Enzyme Inhibition Constant Data from BindingDB
Found 1 hit for monomerid = 7670
Trg + Lig
Ki
nM
ΔG°
kcal/mole
IC50
nM
Kd
nM
EC50/IC50
nM
koff
s-1
kon
M-1s-1
pHTemp
°C
CDK2/CycE
(Homo sapiens (Human))
BDBM7670
(Imidazo[1,2-a]pyridine deriv. 4g | N-(2-methoxyeth...)
Show SMILES COCCNS(=O)(=O)c1ccc(Nc2nccc(n2)-c2cnc3ccc(Sc4ccccc4)cn23)cc1
Show InChI InChI=1S/C26H24N6O3S2/c1-35-16-15-29-37(33,34)22-10-7-19(8-11-22)30-26-27-14-13-23(31-26)24-17-28-25-12-9-21(18-32(24)25)36-20-5-3-2-4-6-20/h2-14,17-18,29H,15-16H2,1H3,(H,27,30,31)
n/an/a 16n/an/an/an/a7.022
AstraZeneca
Assay Description
The kinase activity was assayed using an in vitro scintillation proximity assay (SPA) for measuring incorporation of [gamma-33P] ATP into GST-Rb.
Bioorg Med Chem Lett 14: 2249-52 (2004)
Article DOI: 10.1016/j.bmcl.2004.02.008
BindingDB Entry DOI: 10.7270/Q2XG9PCF