BDBM7671 4-[(4-{imidazo[1,2-a]pyridazin-3-yl}pyrimidin-2-yl)amino]benzene-1-sulfonamide::Imidazo[1,2-b]pyridazine deriv. 2a
SMILES: NS(=O)(=O)c1ccc(Nc2nccc(n2)-c2cnc3cccnn23)cc1
InChI Key: InChIKey=PJGLJKALADHIAR-UHFFFAOYSA-N
Data: 1 IC50
PDB links: 1 PDB ID contains this monomer as substructures. 1 PDB ID contains inhibitors having a similarity of 90% to this monomer.
Activity Spreadsheet -- Enzyme Inhibition Constant Data from BindingDB
Found 1 hit for monomerid = 7671
Trg + Lig
Ki
nM
ΔG°
kcal/mole
IC50
nM
Kd
nM
EC50/IC50
nM
koff
s-1
kon
M-1s-1
pHTemp
°C
CDK2/CycE
(Homo sapiens (Human))
BDBM7671
(4-[(4-{imidazo[1,2-a]pyridazin-3-yl}pyrimidin-2-yl...)
Show SMILES NS(=O)(=O)c1ccc(Nc2nccc(n2)-c2cnc3cccnn23)cc1
Show InChI InChI=1S/C16H13N7O2S/c17-26(24,25)12-5-3-11(4-6-12)21-16-18-9-7-13(22-16)14-10-19-15-2-1-8-20-23(14)15/h1-10H,(H2,17,24,25)(H,18,21,22)
n/an/a<3n/an/an/an/a7.022
AstraZeneca
Assay Description
The kinase activity was assayed using an in vitro scintillation proximity assay (SPA) for measuring incorporation of [gamma-33P] ATP into GST-Rb.
Bioorg Med Chem Lett 14: 2249-52 (2004)
Article DOI: 10.1016/j.bmcl.2004.02.008
BindingDB Entry DOI: 10.7270/Q2XG9PCF