BDBM7678 Imidazo[1,2-b]pyridazine deriv. 4a::N-(2-methoxyethyl)-4-[(4-{6-methoxyimidazo[1,2-a]pyridazin-3-yl}pyrimidin-2-yl)amino]benzene-1-sulfonamide
SMILES: COCCNS(=O)(=O)c1ccc(Nc2nccc(n2)-c2cnc3ccc(OC)nn23)cc1
InChI Key: InChIKey=CYWMSXAOGHNTKV-UHFFFAOYSA-N
Data: 1 IC50
Activity Spreadsheet -- Enzyme Inhibition Constant Data from BindingDB
Found 1 hit for monomerid = 7678
Trg + Lig
Ki
nM
ΔG°
kcal/mole
IC50
nM
Kd
nM
EC50/IC50
nM
koff
s-1
kon
M-1s-1
pHTemp
°C
CDK2/CycE
(Homo sapiens (Human))
BDBM7678
(Imidazo[1,2-b]pyridazine deriv. 4a | N-(2-methoxye...)
Show SMILES COCCNS(=O)(=O)c1ccc(Nc2nccc(n2)-c2cnc3ccc(OC)nn23)cc1
Show InChI InChI=1S/C20H21N7O4S/c1-30-12-11-23-32(28,29)15-5-3-14(4-6-15)24-20-21-10-9-16(25-20)17-13-22-18-7-8-19(31-2)26-27(17)18/h3-10,13,23H,11-12H2,1-2H3,(H,21,24,25)
n/an/a 600n/an/an/an/a7.022
AstraZeneca
Assay Description
The kinase activity was assayed using an in vitro scintillation proximity assay (SPA) for measuring incorporation of [gamma-33P] ATP into GST-Rb.
Bioorg Med Chem Lett 14: 2249-52 (2004)
Article DOI: 10.1016/j.bmcl.2004.02.008
BindingDB Entry DOI: 10.7270/Q2XG9PCF