null
SMILES: Cc1ccc(cc1-c1cc(nc(n1)N1CCS(=O)(=O)CC1)N1CCOCC1)C(=O)Nc1cccc(c1)C(F)(F)F
InChI Key: InChIKey=KAAVGAUVTMYYBL-UHFFFAOYSA-N
Activity Spreadsheet -- Enzyme Inhibition Constant Data from BindingDB
Found 20 hits for monomerid = 77059
Trg + Lig
Ki
nM
ΔG°
kcal/mole
IC50
nM
Kd
nM
EC50/IC50
nM
koff
s-1
kon
M-1s-1
pHTemp
°C
Serine/threonine-protein kinase B-raf [V600E]
(Homo sapiens (Human))
BDBM77059
(US10245267, Example 9 | US10709712, Example 9 | US...)
Show SMILES Cc1ccc(cc1-c1cc(nc(n1)N1CCS(=O)(=O)CC1)N1CCOCC1)C(=O)Nc1cccc(c1)C(F)(F)F |$;;;;;;;;;;;;;;;;;;;;;;;;;;;;;HN;;;;;;;;;;$|
Show InChI InChI=1S/C27H28F3N5O4S/c1-18-5-6-19(25(36)31-21-4-2-3-20(16-21)27(28,29)30)15-22(18)23-17-24(34-7-11-39-12-8-34)33-26(32-23)35-9-13-40(37,38)14-10-35/h2-6,15-17H,7-14H2,1H3,(H,31,36)
US Patent
n/an/a 1.59n/an/an/an/a7.525
NOVARTIS AG
US Patent
Assay Description
Raf and biotinylated Mek, kinase dead, were combined at 2x final concentrations in assay buffer (50 mM Tris, pH 7.5, 15 mM MgCl2, 0.01% BSA and 1 mM ...
US Patent US9694016 (2017)
BindingDB Entry DOI: 10.7270/Q2MC8X6W
RAF proto-oncogene serine/threonine-protein kinase
(Homo sapiens (Human))
BDBM77059
(US10245267, Example 9 | US10709712, Example 9 | US...)
Show SMILES Cc1ccc(cc1-c1cc(nc(n1)N1CCS(=O)(=O)CC1)N1CCOCC1)C(=O)Nc1cccc(c1)C(F)(F)F |$;;;;;;;;;;;;;;;;;;;;;;;;;;;;;HN;;;;;;;;;;$|
Show InChI InChI=1S/C27H28F3N5O4S/c1-18-5-6-19(25(36)31-21-4-2-3-20(16-21)27(28,29)30)15-22(18)23-17-24(34-7-11-39-12-8-34)33-26(32-23)35-9-13-40(37,38)14-10-35/h2-6,15-17H,7-14H2,1H3,(H,31,36)
NCI pathway
Reactome pathway
US Patent
n/an/a 0.900n/an/an/an/an/an/a
NOVARTIS AG
US Patent
Assay Description
C-Raf TR refers to a truncated C-Raf protein, a Δ1-324 deletion mutant.C-Raf FL refers to the full-length C-Raf protein.Full length MEK1 with an...
US Patent US10709712 (2020)
RAF proto-oncogene serine/threonine-protein kinase [1-324]
(Homo sapiens (Human))
BDBM77059
(US10245267, Example 9 | US10709712, Example 9 | US...)
Show SMILES Cc1ccc(cc1-c1cc(nc(n1)N1CCS(=O)(=O)CC1)N1CCOCC1)C(=O)Nc1cccc(c1)C(F)(F)F |$;;;;;;;;;;;;;;;;;;;;;;;;;;;;;HN;;;;;;;;;;$|
Show InChI InChI=1S/C27H28F3N5O4S/c1-18-5-6-19(25(36)31-21-4-2-3-20(16-21)27(28,29)30)15-22(18)23-17-24(34-7-11-39-12-8-34)33-26(32-23)35-9-13-40(37,38)14-10-35/h2-6,15-17H,7-14H2,1H3,(H,31,36)
US Patent
n/an/a 0.900n/an/an/an/a7.525
NOVARTIS AG
US Patent
Assay Description
Raf and biotinylated Mek, kinase dead, were combined at 2x final concentrations in assay buffer (50 mM Tris, pH 7.5, 15 mM MgCl2, 0.01% BSA and 1 mM ...
US Patent US9694016 (2017)
BindingDB Entry DOI: 10.7270/Q2MC8X6W
Serine/threonine-protein kinase B-raf [V600E]
(Homo sapiens (Human))
BDBM77059
(US10245267, Example 9 | US10709712, Example 9 | US...)
Show SMILES Cc1ccc(cc1-c1cc(nc(n1)N1CCS(=O)(=O)CC1)N1CCOCC1)C(=O)Nc1cccc(c1)C(F)(F)F |$;;;;;;;;;;;;;;;;;;;;;;;;;;;;;HN;;;;;;;;;;$|
Show InChI InChI=1S/C27H28F3N5O4S/c1-18-5-6-19(25(36)31-21-4-2-3-20(16-21)27(28,29)30)15-22(18)23-17-24(34-7-11-39-12-8-34)33-26(32-23)35-9-13-40(37,38)14-10-35/h2-6,15-17H,7-14H2,1H3,(H,31,36)
US Patent
n/an/a 1.5n/an/an/an/a7.525
NOVARTIS AG
US Patent
Assay Description
Raf and biotinylated Mek, kinase dead, were combined at 2x final concentrations in assay buffer (50 mM Tris, pH 7.5, 15 mM MgCl2, 0.01% BSA and 1 mM ...
US Patent US9694016 (2017)
BindingDB Entry DOI: 10.7270/Q2MC8X6W
RAF proto-oncogene serine/threonine-protein kinase [Y340E,Y341E]
(Homo sapiens (Human))
BDBM77059
(US10245267, Example 9 | US10709712, Example 9 | US...)
Show SMILES Cc1ccc(cc1-c1cc(nc(n1)N1CCS(=O)(=O)CC1)N1CCOCC1)C(=O)Nc1cccc(c1)C(F)(F)F |$;;;;;;;;;;;;;;;;;;;;;;;;;;;;;HN;;;;;;;;;;$|
Show InChI InChI=1S/C27H28F3N5O4S/c1-18-5-6-19(25(36)31-21-4-2-3-20(16-21)27(28,29)30)15-22(18)23-17-24(34-7-11-39-12-8-34)33-26(32-23)35-9-13-40(37,38)14-10-35/h2-6,15-17H,7-14H2,1H3,(H,31,36)
US Patent
n/an/a 0.900n/an/an/an/a7.525
NOVARTIS AG
US Patent
Assay Description
Raf and biotinylated Mek, kinase dead, were combined at 2x final concentrations in assay buffer (50 mM Tris, pH 7.5, 15 mM MgCl2, 0.01% BSA and 1 mM ...
US Patent US9694016 (2017)
BindingDB Entry DOI: 10.7270/Q2MC8X6W
Serine/threonine-protein kinase B-raf [V600E]
(Homo sapiens (Human))
BDBM77059
(US10245267, Example 9 | US10709712, Example 9 | US...)
Show SMILES Cc1ccc(cc1-c1cc(nc(n1)N1CCS(=O)(=O)CC1)N1CCOCC1)C(=O)Nc1cccc(c1)C(F)(F)F |$;;;;;;;;;;;;;;;;;;;;;;;;;;;;;HN;;;;;;;;;;$|
Show InChI InChI=1S/C27H28F3N5O4S/c1-18-5-6-19(25(36)31-21-4-2-3-20(16-21)27(28,29)30)15-22(18)23-17-24(34-7-11-39-12-8-34)33-26(32-23)35-9-13-40(37,38)14-10-35/h2-6,15-17H,7-14H2,1H3,(H,31,36)
US Patent
n/an/a 0.837n/an/an/an/an/an/a
Bristol-Myers Squibb Company
Assay Description
Raf and biotinylated Mek, kinase dead, were combined at 2× final concentrations in assay buffer (50 mM Tris, pH 7.5, 15 mM MgCl2, 0.01% BSA and 1 mM ...
Bioorg Med Chem Lett 17: 5115-20 (2007)
BindingDB Entry DOI: 10.7270/Q2RB76WP
RAF proto-oncogene serine/threonine-protein kinase
(Homo sapiens (Human))
BDBM77059
(US10245267, Example 9 | US10709712, Example 9 | US...)
Show SMILES Cc1ccc(cc1-c1cc(nc(n1)N1CCS(=O)(=O)CC1)N1CCOCC1)C(=O)Nc1cccc(c1)C(F)(F)F |$;;;;;;;;;;;;;;;;;;;;;;;;;;;;;HN;;;;;;;;;;$|
Show InChI InChI=1S/C27H28F3N5O4S/c1-18-5-6-19(25(36)31-21-4-2-3-20(16-21)27(28,29)30)15-22(18)23-17-24(34-7-11-39-12-8-34)33-26(32-23)35-9-13-40(37,38)14-10-35/h2-6,15-17H,7-14H2,1H3,(H,31,36)
NCI pathway
Reactome pathway
US Patent
n/an/a 0.389n/an/an/an/an/an/a
Bristol-Myers Squibb Company
Assay Description
Raf and biotinylated Mek, kinase dead, were combined at 2× final concentrations in assay buffer (50 mM Tris, pH 7.5, 15 mM MgCl2, 0.01% BSA and 1 mM ...
Bioorg Med Chem Lett 17: 5115-20 (2007)
BindingDB Entry DOI: 10.7270/Q2RB76WP
RAF proto-oncogene serine/threonine-protein kinase [1-324]
(Homo sapiens (Human))
BDBM77059
(US10245267, Example 9 | US10709712, Example 9 | US...)
Show SMILES Cc1ccc(cc1-c1cc(nc(n1)N1CCS(=O)(=O)CC1)N1CCOCC1)C(=O)Nc1cccc(c1)C(F)(F)F |$;;;;;;;;;;;;;;;;;;;;;;;;;;;;;HN;;;;;;;;;;$|
Show InChI InChI=1S/C27H28F3N5O4S/c1-18-5-6-19(25(36)31-21-4-2-3-20(16-21)27(28,29)30)15-22(18)23-17-24(34-7-11-39-12-8-34)33-26(32-23)35-9-13-40(37,38)14-10-35/h2-6,15-17H,7-14H2,1H3,(H,31,36)
US Patent
n/an/a 0.514n/an/an/an/an/an/a
Bristol-Myers Squibb Company
Assay Description
Raf and biotinylated Mek, kinase dead, were combined at 2× final concentrations in assay buffer (50 mM Tris, pH 7.5, 15 mM MgCl2, 0.01% BSA and 1 mM ...
Bioorg Med Chem Lett 17: 5115-20 (2007)
BindingDB Entry DOI: 10.7270/Q2RB76WP
Serine/threonine-protein kinase B-raf [V600E]
(Homo sapiens (Human))
BDBM77059
(US10245267, Example 9 | US10709712, Example 9 | US...)
Show SMILES Cc1ccc(cc1-c1cc(nc(n1)N1CCS(=O)(=O)CC1)N1CCOCC1)C(=O)Nc1cccc(c1)C(F)(F)F |$;;;;;;;;;;;;;;;;;;;;;;;;;;;;;HN;;;;;;;;;;$|
Show InChI InChI=1S/C27H28F3N5O4S/c1-18-5-6-19(25(36)31-21-4-2-3-20(16-21)27(28,29)30)15-22(18)23-17-24(34-7-11-39-12-8-34)33-26(32-23)35-9-13-40(37,38)14-10-35/h2-6,15-17H,7-14H2,1H3,(H,31,36)
US Patent
n/an/a 1.59n/an/an/an/an/an/a
Bristol-Myers Squibb Company
Assay Description
Raf and biotinylated Mek, kinase dead, were combined at 2× final concentrations in assay buffer (50 mM Tris, pH 7.5, 15 mM MgCl2, 0.01% BSA and 1 mM ...
Bioorg Med Chem Lett 17: 5115-20 (2007)
BindingDB Entry DOI: 10.7270/Q2RB76WP
RAF proto-oncogene serine/threonine-protein kinase
(Homo sapiens (Human))
BDBM77059
(US10245267, Example 9 | US10709712, Example 9 | US...)
Show SMILES Cc1ccc(cc1-c1cc(nc(n1)N1CCS(=O)(=O)CC1)N1CCOCC1)C(=O)Nc1cccc(c1)C(F)(F)F |$;;;;;;;;;;;;;;;;;;;;;;;;;;;;;HN;;;;;;;;;;$|
Show InChI InChI=1S/C27H28F3N5O4S/c1-18-5-6-19(25(36)31-21-4-2-3-20(16-21)27(28,29)30)15-22(18)23-17-24(34-7-11-39-12-8-34)33-26(32-23)35-9-13-40(37,38)14-10-35/h2-6,15-17H,7-14H2,1H3,(H,31,36)
NCI pathway
Reactome pathway
US Patent
n/an/a 0.949n/an/an/an/an/an/a
Bristol-Myers Squibb Company
Assay Description
Raf and biotinylated Mek, kinase dead, were combined at 2× final concentrations in assay buffer (50 mM Tris, pH 7.5, 15 mM MgCl2, 0.01% BSA and 1 mM ...
Bioorg Med Chem Lett 17: 5115-20 (2007)
BindingDB Entry DOI: 10.7270/Q2RB76WP
RAF proto-oncogene serine/threonine-protein kinase [1-324]
(Homo sapiens (Human))
BDBM77059
(US10245267, Example 9 | US10709712, Example 9 | US...)
Show SMILES Cc1ccc(cc1-c1cc(nc(n1)N1CCS(=O)(=O)CC1)N1CCOCC1)C(=O)Nc1cccc(c1)C(F)(F)F |$;;;;;;;;;;;;;;;;;;;;;;;;;;;;;HN;;;;;;;;;;$|
Show InChI InChI=1S/C27H28F3N5O4S/c1-18-5-6-19(25(36)31-21-4-2-3-20(16-21)27(28,29)30)15-22(18)23-17-24(34-7-11-39-12-8-34)33-26(32-23)35-9-13-40(37,38)14-10-35/h2-6,15-17H,7-14H2,1H3,(H,31,36)
US Patent
n/an/a 0.899n/an/an/an/an/an/a
Bristol-Myers Squibb Company
Assay Description
Raf and biotinylated Mek, kinase dead, were combined at 2× final concentrations in assay buffer (50 mM Tris, pH 7.5, 15 mM MgCl2, 0.01% BSA and 1 mM ...
Bioorg Med Chem Lett 17: 5115-20 (2007)
BindingDB Entry DOI: 10.7270/Q2RB76WP
Serine/threonine-protein kinase B-raf [V600E]
(Homo sapiens (Human))
BDBM77059
(US10245267, Example 9 | US10709712, Example 9 | US...)
Show SMILES Cc1ccc(cc1-c1cc(nc(n1)N1CCS(=O)(=O)CC1)N1CCOCC1)C(=O)Nc1cccc(c1)C(F)(F)F |$;;;;;;;;;;;;;;;;;;;;;;;;;;;;;HN;;;;;;;;;;$|
Show InChI InChI=1S/C27H28F3N5O4S/c1-18-5-6-19(25(36)31-21-4-2-3-20(16-21)27(28,29)30)15-22(18)23-17-24(34-7-11-39-12-8-34)33-26(32-23)35-9-13-40(37,38)14-10-35/h2-6,15-17H,7-14H2,1H3,(H,31,36)
US Patent
n/an/a 0.900n/an/an/an/an/an/a
Bristol-Myers Squibb Company
Assay Description
Raf and biotinylated Mek, kinase dead, were combined at 2× final concentrations in assay buffer (50 mM Tris, pH 7.5, 15 mM MgCl2, 0.01% BSA and 1 mM ...
Bioorg Med Chem Lett 17: 5115-20 (2007)
BindingDB Entry DOI: 10.7270/Q2RB76WP
RAF proto-oncogene serine/threonine-protein kinase
(Homo sapiens (Human))
BDBM77059
(US10245267, Example 9 | US10709712, Example 9 | US...)
Show SMILES Cc1ccc(cc1-c1cc(nc(n1)N1CCS(=O)(=O)CC1)N1CCOCC1)C(=O)Nc1cccc(c1)C(F)(F)F |$;;;;;;;;;;;;;;;;;;;;;;;;;;;;;HN;;;;;;;;;;$|
Show InChI InChI=1S/C27H28F3N5O4S/c1-18-5-6-19(25(36)31-21-4-2-3-20(16-21)27(28,29)30)15-22(18)23-17-24(34-7-11-39-12-8-34)33-26(32-23)35-9-13-40(37,38)14-10-35/h2-6,15-17H,7-14H2,1H3,(H,31,36)
NCI pathway
Reactome pathway
US Patent
n/an/a 0.5n/an/an/an/an/an/a
Bristol-Myers Squibb Company
Assay Description
Raf and biotinylated Mek, kinase dead, were combined at 2× final concentrations in assay buffer (50 mM Tris, pH 7.5, 15 mM MgCl2, 0.01% BSA and 1 mM ...
Bioorg Med Chem Lett 17: 5115-20 (2007)
BindingDB Entry DOI: 10.7270/Q2RB76WP
Serine/threonine-protein kinase B-raf [V600E]
(Homo sapiens (Human))
BDBM77059
(US10245267, Example 9 | US10709712, Example 9 | US...)
Show SMILES Cc1ccc(cc1-c1cc(nc(n1)N1CCS(=O)(=O)CC1)N1CCOCC1)C(=O)Nc1cccc(c1)C(F)(F)F |$;;;;;;;;;;;;;;;;;;;;;;;;;;;;;HN;;;;;;;;;;$|
Show InChI InChI=1S/C27H28F3N5O4S/c1-18-5-6-19(25(36)31-21-4-2-3-20(16-21)27(28,29)30)15-22(18)23-17-24(34-7-11-39-12-8-34)33-26(32-23)35-9-13-40(37,38)14-10-35/h2-6,15-17H,7-14H2,1H3,(H,31,36)
US Patent
n/an/a 1.5n/an/an/an/an/an/a
Bristol-Myers Squibb Company
Assay Description
Raf and biotinylated Mek, kinase dead, were combined at 2× final concentrations in assay buffer (50 mM Tris, pH 7.5, 15 mM MgCl2, 0.01% BSA and 1 mM ...
Bioorg Med Chem Lett 17: 5115-20 (2007)
BindingDB Entry DOI: 10.7270/Q2RB76WP
RAF proto-oncogene serine/threonine-protein kinase
(Homo sapiens (Human))
BDBM77059
(US10245267, Example 9 | US10709712, Example 9 | US...)
Show SMILES Cc1ccc(cc1-c1cc(nc(n1)N1CCS(=O)(=O)CC1)N1CCOCC1)C(=O)Nc1cccc(c1)C(F)(F)F |$;;;;;;;;;;;;;;;;;;;;;;;;;;;;;HN;;;;;;;;;;$|
Show InChI InChI=1S/C27H28F3N5O4S/c1-18-5-6-19(25(36)31-21-4-2-3-20(16-21)27(28,29)30)15-22(18)23-17-24(34-7-11-39-12-8-34)33-26(32-23)35-9-13-40(37,38)14-10-35/h2-6,15-17H,7-14H2,1H3,(H,31,36)
NCI pathway
Reactome pathway
US Patent
n/an/a 0.900n/an/an/an/an/an/a
Bristol-Myers Squibb Company
Assay Description
Raf and biotinylated Mek, kinase dead, were combined at 2× final concentrations in assay buffer (50 mM Tris, pH 7.5, 15 mM MgCl2, 0.01% BSA and 1 mM ...
Bioorg Med Chem Lett 17: 5115-20 (2007)
BindingDB Entry DOI: 10.7270/Q2RB76WP
Serine/threonine-protein kinase B-raf [V600E]
(Homo sapiens (Human))
BDBM77059
(US10245267, Example 9 | US10709712, Example 9 | US...)
Show SMILES Cc1ccc(cc1-c1cc(nc(n1)N1CCS(=O)(=O)CC1)N1CCOCC1)C(=O)Nc1cccc(c1)C(F)(F)F |$;;;;;;;;;;;;;;;;;;;;;;;;;;;;;HN;;;;;;;;;;$|
Show InChI InChI=1S/C27H28F3N5O4S/c1-18-5-6-19(25(36)31-21-4-2-3-20(16-21)27(28,29)30)15-22(18)23-17-24(34-7-11-39-12-8-34)33-26(32-23)35-9-13-40(37,38)14-10-35/h2-6,15-17H,7-14H2,1H3,(H,31,36)
US Patent
n/an/a 1.59n/an/an/an/an/an/a
NOVARTIS AG
US Patent
Assay Description
C-Raf TR refers to a truncated C-Raf protein, a Δ1-324 deletion mutant.C-Raf FL refers to the full-length C-Raf protein.Full length MEK1 with an...
US Patent US10709712 (2020)
RAF proto-oncogene serine/threonine-protein kinase
(Homo sapiens (Human))
BDBM77059
(US10245267, Example 9 | US10709712, Example 9 | US...)
Show SMILES Cc1ccc(cc1-c1cc(nc(n1)N1CCS(=O)(=O)CC1)N1CCOCC1)C(=O)Nc1cccc(c1)C(F)(F)F |$;;;;;;;;;;;;;;;;;;;;;;;;;;;;;HN;;;;;;;;;;$|
Show InChI InChI=1S/C27H28F3N5O4S/c1-18-5-6-19(25(36)31-21-4-2-3-20(16-21)27(28,29)30)15-22(18)23-17-24(34-7-11-39-12-8-34)33-26(32-23)35-9-13-40(37,38)14-10-35/h2-6,15-17H,7-14H2,1H3,(H,31,36)
NCI pathway
Reactome pathway
US Patent
n/an/a 0.949n/an/an/an/an/an/a
NOVARTIS AG
US Patent
Assay Description
C-Raf TR refers to a truncated C-Raf protein, a Δ1-324 deletion mutant.C-Raf FL refers to the full-length C-Raf protein.Full length MEK1 with an...
US Patent US10709712 (2020)
RAF proto-oncogene serine/threonine-protein kinase [325-648]
(Homo sapiens (Human))
BDBM77059
(US10245267, Example 9 | US10709712, Example 9 | US...)
Show SMILES Cc1ccc(cc1-c1cc(nc(n1)N1CCS(=O)(=O)CC1)N1CCOCC1)C(=O)Nc1cccc(c1)C(F)(F)F |$;;;;;;;;;;;;;;;;;;;;;;;;;;;;;HN;;;;;;;;;;$|
Show InChI InChI=1S/C27H28F3N5O4S/c1-18-5-6-19(25(36)31-21-4-2-3-20(16-21)27(28,29)30)15-22(18)23-17-24(34-7-11-39-12-8-34)33-26(32-23)35-9-13-40(37,38)14-10-35/h2-6,15-17H,7-14H2,1H3,(H,31,36)
US Patent
n/an/a 0.899n/an/an/an/an/an/a
NOVARTIS AG
US Patent
Assay Description
C-Raf TR refers to a truncated C-Raf protein, a Δ1-324 deletion mutant.C-Raf FL refers to the full-length C-Raf protein.Full length MEK1 with an...
US Patent US10709712 (2020)
Serine/threonine-protein kinase B-raf [V600E]
(Homo sapiens (Human))
BDBM77059
(US10245267, Example 9 | US10709712, Example 9 | US...)
Show SMILES Cc1ccc(cc1-c1cc(nc(n1)N1CCS(=O)(=O)CC1)N1CCOCC1)C(=O)Nc1cccc(c1)C(F)(F)F |$;;;;;;;;;;;;;;;;;;;;;;;;;;;;;HN;;;;;;;;;;$|
Show InChI InChI=1S/C27H28F3N5O4S/c1-18-5-6-19(25(36)31-21-4-2-3-20(16-21)27(28,29)30)15-22(18)23-17-24(34-7-11-39-12-8-34)33-26(32-23)35-9-13-40(37,38)14-10-35/h2-6,15-17H,7-14H2,1H3,(H,31,36)
US Patent
n/an/a 1.5n/an/an/an/an/an/a
NOVARTIS AG
US Patent
Assay Description
C-Raf TR refers to a truncated C-Raf protein, a Δ1-324 deletion mutant.C-Raf FL refers to the full-length C-Raf protein.Full length MEK1 with an...
US Patent US10709712 (2020)
RAF proto-oncogene serine/threonine-protein kinase [Y340E,Y341E]
(Homo sapiens (Human))
BDBM77059
(US10245267, Example 9 | US10709712, Example 9 | US...)
Show SMILES Cc1ccc(cc1-c1cc(nc(n1)N1CCS(=O)(=O)CC1)N1CCOCC1)C(=O)Nc1cccc(c1)C(F)(F)F |$;;;;;;;;;;;;;;;;;;;;;;;;;;;;;HN;;;;;;;;;;$|
Show InChI InChI=1S/C27H28F3N5O4S/c1-18-5-6-19(25(36)31-21-4-2-3-20(16-21)27(28,29)30)15-22(18)23-17-24(34-7-11-39-12-8-34)33-26(32-23)35-9-13-40(37,38)14-10-35/h2-6,15-17H,7-14H2,1H3,(H,31,36)
US Patent
n/an/a 0.950n/an/an/an/a7.525
NOVARTIS AG
US Patent
Assay Description
Raf and biotinylated Mek, kinase dead, were combined at 2x final concentrations in assay buffer (50 mM Tris, pH 7.5, 15 mM MgCl2, 0.01% BSA and 1 mM ...
US Patent US9694016 (2017)
BindingDB Entry DOI: 10.7270/Q2MC8X6W