BDBM77064 US9695197, 4
SMILES: CNC1=N[C@H]2[C@@H](S1)S[C@H](CO)[C@@H](O)[C@@H]2O
InChI Key: InChIKey=IFRYKXGGWRNSPW-NYMZXIIRSA-N
Data: 1 KI  1 EC50
Activity Spreadsheet -- Enzyme Inhibition Constant Data from BindingDB
Found 2 hits for monomerid = 77064
Trg + Lig
Ki
nM
ΔG°
kcal/mole
IC50
nM
Kd
nM
EC50/IC50
nM
koff
s-1
kon
M-1s-1
pHTemp
°C
Protein O-GlcNAcase
(Homo sapiens (Human))
BDBM77064
(US9695197, 4)
Show SMILES CNC1=N[C@H]2[C@@H](S1)S[C@H](CO)[C@@H](O)[C@@H]2O |r,t:2|
Show InChI InChI=1S/C8H14N2O3S2/c1-9-8-10-4-6(13)5(12)3(2-11)14-7(4)15-8/h3-7,11-13H,2H2,1H3,(H,9,10)/t3-,4-,5-,6-,7-/m1/s1
US Patent
0.110 -13.6n/an/an/an/an/a7.025
Alectos Therapeutics Inc.; Merck Sharp & Dohme Corp.
US Patent
Assay Description
Enzymatic reactions were carried out in a reaction containing 50 mM NaH2PO4, 100 mM NaCl and 0.1% BSA (pH 7.0) using 2 mM 4-Methylumbelliferyl N-acet...
US Patent US9695197 (2017)
BindingDB Entry DOI: 10.7270/Q247481J
Protein O-GlcNAcase
(Homo sapiens (Human))
BDBM77064
(US9695197, 4)
Show SMILES CNC1=N[C@H]2[C@@H](S1)S[C@H](CO)[C@@H](O)[C@@H]2O |r,t:2|
Show InChI InChI=1S/C8H14N2O3S2/c1-9-8-10-4-6(13)5(12)3(2-11)14-7(4)15-8/h3-7,11-13H,2H2,1H3,(H,9,10)/t3-,4-,5-,6-,7-/m1/s1
US Patent
n/an/an/an/a 3n/an/an/a4
Alectos Therapeutics Inc.; Merck Sharp & Dohme Corp.
US Patent
Assay Description
The ELISA portion of the assay is performed in a black Maxisorp 96-well plate that is coated overnight at 4° C. with 100 uL/well of the cell lysa...
US Patent US9695197 (2017)
BindingDB Entry DOI: 10.7270/Q247481J