BDBM77495 4-(m-anisoylamino)-2,3-dihydrothiophene-5-carboxylic acid methyl ester::4-[[(3-methoxyphenyl)-oxomethyl]amino]-2,3-dihydrothiophene-5-carboxylic acid methyl ester::MLS000087766::SMR000023986::cid_3241864::methyl 3-[(3-methoxybenzoyl)amino]-4,5-dihydrothiophene-2-carboxylate::methyl 4-[(3-methoxybenzoyl)amino]-2,3-dihydrothiophene-5-carboxylate::methyl 4-[(3-methoxyphenyl)carbonylamino]-2,3-dihydrothiophene-5-carboxylate
SMILES: COC(=O)C1=C(CCS1)NC(=O)c1cccc(OC)c1
InChI Key: InChIKey=GPDZLUNLXHMMLS-UHFFFAOYSA-N
Data: 3 EC50
Activity Spreadsheet -- Enzyme Inhibition Constant Data from BindingDB
Found 3 hits for monomerid = 77495
Trg + Lig
Ki
nM
ΔG°
kcal/mole
IC50
nM
Kd
nM
EC50/IC50
nM
koff
s-1
kon
M-1s-1
pHTemp
°C
Caspase-7
(Homo sapiens (Human))
BDBM77495
(4-(m-anisoylamino)-2,3-dihydrothiophene-5-carboxyl...)
Show SMILES COC(=O)C1=C(CCS1)NC(=O)c1cccc(OC)c1 |t:4|
Show InChI InChI=1S/C14H15NO4S/c1-18-10-5-3-4-9(8-10)13(16)15-11-6-7-20-12(11)14(17)19-2/h3-5,8H,6-7H2,1-2H3,(H,15,16)
NCI pathway
Reactome pathway
PCBioAssay
n/an/an/an/a>8.53E+4n/an/an/an/a
The Scripps Research Institute Molecular Screening Center
Curated by PubChem BioAssay
Assay Description
Source (MLPCN Center Name): The Scripps Research Institute Molecular Screening Center (SRIMSC) Affiliation: The Scripps Research Institute, TSR...
PubChem Bioassay (2010)
BindingDB Entry DOI: 10.7270/Q22V2DK6
corticotropin releasing factor-binding protein
(Homo sapiens (Human))
BDBM77495
(4-(m-anisoylamino)-2,3-dihydrothiophene-5-carboxyl...)
Show SMILES COC(=O)C1=C(CCS1)NC(=O)c1cccc(OC)c1 |t:4|
Show InChI InChI=1S/C14H15NO4S/c1-18-10-5-3-4-9(8-10)13(16)15-11-6-7-20-12(11)14(17)19-2/h3-5,8H,6-7H2,1-2H3,(H,15,16)
PCBioAssay
n/an/an/an/a>5.30E+4n/an/an/an/a
Burnham Center for Chemical Genomics
Curated by PubChem BioAssay
Assay Description
Data Source: Sanford-Burnham Center for Chemical Genomics (SBCCG) Source Affiliation: Sanford-Burnham Medical Research Institute (SBMRI, San Diego, C...
PubChem Bioassay (2012)
BindingDB Entry DOI: 10.7270/Q2VX0F3D
Caspase-3
(Homo sapiens (Human))
BDBM77495
(4-(m-anisoylamino)-2,3-dihydrothiophene-5-carboxyl...)
Show SMILES COC(=O)C1=C(CCS1)NC(=O)c1cccc(OC)c1 |t:4|
Show InChI InChI=1S/C14H15NO4S/c1-18-10-5-3-4-9(8-10)13(16)15-11-6-7-20-12(11)14(17)19-2/h3-5,8H,6-7H2,1-2H3,(H,15,16)
NCI pathway
Reactome pathway
PCBioAssay
n/an/an/an/a>8.53E+4n/an/an/an/a
The Scripps Research Institute Molecular Screening Center
Curated by PubChem BioAssay
Assay Description
Source (MLPCN Center Name): The Scripps Research Institute Molecular Screening Center (SRIMSC) Affiliation: The Scripps Research Institute, TSR...
PubChem Bioassay (2010)
BindingDB Entry DOI: 10.7270/Q2Z31X4P