BDBM77610 4-phenyl-2,4,5,10-tetrahydro-1H-pyrrolo[3,4-c][1,5]benzodiazepin-3-one::MLS000106925::SMR000111300::cid_2848107
SMILES: O=C1NCC2=Nc3ccccc3NC(C12)c1ccccc1
InChI Key: InChIKey=KCLKPPOQKQRKOU-UHFFFAOYSA-N
Data: 1 IC50
Activity Spreadsheet -- Enzyme Inhibition Constant Data from BindingDB
Found 1 hit for monomerid = 77610
Trg + Lig
Ki
nM
ΔG°
kcal/mole
IC50
nM
Kd
nM
EC50/IC50
nM
koff
s-1
kon
M-1s-1
pHTemp
°C
protein-arginine deiminase type-4
(Homo sapiens (Human))
BDBM77610
(4-phenyl-2,4,5,10-tetrahydro-1H-pyrrolo[3,4-c][1,5...)
Show SMILES O=C1NCC2=Nc3ccccc3NC(C12)c1ccccc1 |t:4|
Show InChI InChI=1S/C17H15N3O/c21-17-15-14(10-18-17)19-12-8-4-5-9-13(12)20-16(15)11-6-2-1-3-7-11/h1-9,15-16,20H,10H2,(H,18,21)
PCBioAssay
n/an/a 1.00E+5n/an/an/an/an/an/a
The Scripps Research Institute Molecular Screening Center
Curated by PubChem BioAssay
Assay Description
Source (MLPCN Center Name): The Scripps Research Institute Molecular Screening Center (SRIMSC) Affiliation: The Scripps Research Institute, TSRI Assa...
PubChem Bioassay (2010)
BindingDB Entry DOI: 10.7270/Q2PK0DMQ