BDBM787 4-hydroxy-3-(3-methyl-1-phenylbutyl)-2H,5H,6H,7H,8H,9H,10H-cycloocta[b]pyran-2-one::5,6,7,8,9,1O-Hexahydro-4-hydroxy-3-(3-methyl- l-phe-nylbutyl)-W-cycloocta[b]pyran-2-one::Cyclooctylpyranone 10
SMILES: CC(C)CC(c1ccccc1)c1c(O)c2CCCCCCc2oc1=O
InChI Key: InChIKey=VLJOZQWJEGNYAL-UHFFFAOYSA-N
Data: 1 KI
Activity Spreadsheet -- Enzyme Inhibition Constant Data from BindingDB
Found 1 hit for monomerid = 787
Trg + Lig
Ki
nM
ΔG°
kcal/mole
IC50
nM
Kd
nM
EC50/IC50
nM
koff
s-1
kon
M-1s-1
pHTemp
°C
HIV-1 Protease
(Human immunodeficiency virus type 1)
BDBM787
(4-hydroxy-3-(3-methyl-1-phenylbutyl)-2H,5H,6H,7H,8...)
Show SMILES CC(C)CC(c1ccccc1)c1c(O)c2CCCCCCc2oc1=O
Show InChI InChI=1S/C22H28O3/c1-15(2)14-18(16-10-6-5-7-11-16)20-21(23)17-12-8-3-4-9-13-19(17)25-22(20)24/h5-7,10-11,15,18,23H,3-4,8-9,12-14H2,1-2H3
90 -9.51n/an/an/an/an/a5.022
Upjohn
Assay Description
HIV-1 protease was purified and refolded from E. coli inclusion bodies. The substrate used spans the p17-p24 processing site (R-V-S-Q-N-Y-P-I-V-Q-N-K...
J Med Chem 38: 1884-91 (1995)
Article DOI: 10.1021/jm00011a008
BindingDB Entry DOI: 10.7270/Q2Q81B80