BDBM790 3-benzyl-4-hydroxy-2H,5H,6H,7H,8H,9H,10H-cycloocta[b]pyran-2-one::Cyclooctylpyranone 13
SMILES: Oc1c(Cc2ccccc2)c(=O)oc2CCCCCCc12
InChI Key: InChIKey=QWJMOXSHVWEFEX-UHFFFAOYSA-N
Data: 1 Other
PDB links: 3 PDB IDs contain this monomer as substructures. 3 PDB IDs contain inhibitors having a similarity of 90% to this monomer.
Activity Spreadsheet -- Enzyme Inhibition Constant Data from BindingDB
Found 1 hit for monomerid = 790
Trg + Lig
Ki
nM
ΔG°
kcal/mole
IC50
nM
Kd
nM
EC50/IC50
nM
koff
s-1
kon
M-1s-1
pHTemp
°C
HIV-1 Protease
(Human immunodeficiency virus type 1)
BDBM790
(3-benzyl-4-hydroxy-2H,5H,6H,7H,8H,9H,10H-cycloocta...)
Show SMILES Oc1c(Cc2ccccc2)c(=O)oc2CCCCCCc12
Show InChI InChI=1S/C18H20O3/c19-17-14-10-6-1-2-7-11-16(14)21-18(20)15(17)12-13-8-4-3-5-9-13/h3-5,8-9,19H,1-2,6-7,10-12H2
n/an/an/an/an/an/an/a5.022
Upjohn
Assay Description
HIV-1 protease was purified and refolded from E. coli inclusion bodies. The substrate used spans the p17-p24 processing site (R-V-S-Q-N-Y-P-I-V-Q-N-K...
J Med Chem 38: 1884-91 (1995)
Article DOI: 10.1021/jm00011a008
BindingDB Entry DOI: 10.7270/Q2Q81B80