null
SMILES: CCCN(C(=O)c1cccc(c1)-n1cccc1)c1c(N)n(Cc2ccccc2)c(=O)[nH]c1=O
InChI Key: InChIKey=HJQICEMBGGBGSI-UHFFFAOYSA-N
Activity Spreadsheet -- Enzyme Inhibition Constant Data from BindingDB
Found 2 hits for monomerid = 79512
Trg + Lig
Ki
nM
ΔG°
kcal/mole
IC50
nM
Kd
nM
EC50/IC50
nM
koff
s-1
kon
M-1s-1
pHTemp
°C
Carboxy-terminal domain RNA polymerase II polypeptide A small phosphatase 1
(Homo sapiens (Human))
BDBM79512
(MLS001098232 | N-(6-amino-1-benzyl-2,4-diketo-pyri...)
Show SMILES CCCN(C(=O)c1cccc(c1)-n1cccc1)c1c(N)n(Cc2ccccc2)c(=O)[nH]c1=O
Show InChI InChI=1S/C25H25N5O3/c1-2-13-29(24(32)19-11-8-12-20(16-19)28-14-6-7-15-28)21-22(26)30(25(33)27-23(21)31)17-18-9-4-3-5-10-18/h3-12,14-16H,2,13,17,26H2,1H3,(H,27,31,33)
PCBioAssay
n/an/a 6.44E+3n/an/an/an/an/an/a
Burnham Center for Chemical Genomics
Curated by PubChem BioAssay
Assay Description
Data Source: Sanford-Burnham Center for Chemical Genomics (SBCCG) Source Affiliation: Sanford-Burnham Medical Research Institute (SBMRI, San Diego, C...
PubChem Bioassay (2011)
BindingDB Entry DOI: 10.7270/Q2V986KM
Beta-adrenergic receptor kinase 1
(Homo sapiens (Human))
BDBM79512
(MLS001098232 | N-(6-amino-1-benzyl-2,4-diketo-pyri...)
Show SMILES CCCN(C(=O)c1cccc(c1)-n1cccc1)c1c(N)n(Cc2ccccc2)c(=O)[nH]c1=O
Show InChI InChI=1S/C25H25N5O3/c1-2-13-29(24(32)19-11-8-12-20(16-19)28-14-6-7-15-28)21-22(26)30(25(33)27-23(21)31)17-18-9-4-3-5-10-18/h3-12,14-16H,2,13,17,26H2,1H3,(H,27,31,33)
Reactome pathway
PCBioAssay
n/an/an/an/a 720n/an/an/an/a
NMMLSC
Curated by PubChem BioAssay
Assay Description
University of New Mexico Assay Overview: Assay Support: 1 R03 DA030557-01A1 Project Title: RNA Aptamer-based screen for Selective Inhibitors of ...
PubChem Bioassay (2011)
BindingDB Entry DOI: 10.7270/Q2B56H72