BDBM79609 5-chloranyl-2-(4-piperidin-1-ylcarbonylphenyl)-3a,4,7,7a-tetrahydroisoindole-1,3-dione::5-chloro-2-[4-(piperidine-1-carbonyl)phenyl]-3a,4,7,7a-tetrahydroisoindole-1,3-dione::5-chloro-2-[4-(piperidine-1-carbonyl)phenyl]-3a,4,7,7a-tetrahydroisoindole-1,3-quinone::5-chloro-2-[4-[oxo(1-piperidinyl)methyl]phenyl]-3a,4,7,7a-tetrahydroisoindole-1,3-dione::VU0125199-5::cid_659809
SMILES: Oc1c2CC=C(Cl)Cc2c(O)n1-c1ccc(cc1)C(=O)N1CCCCC1
InChI Key: InChIKey=YXWOUCUSYDSLQU-UHFFFAOYSA-N
Data: 1 EC50
Activity Spreadsheet -- Enzyme Inhibition Constant Data from BindingDB
Found 1 hit for monomerid = 79609
Trg + Lig
Ki
nM
ΔG°
kcal/mole
IC50
nM
Kd
nM
EC50/IC50
nM
koff
s-1
kon
M-1s-1
pHTemp
°C
integrin alpha-L
(Mus musculus)
BDBM79609
(5-chloranyl-2-(4-piperidin-1-ylcarbonylphenyl)-3a,...)
Show SMILES Oc1c2CC=C(Cl)Cc2c(O)n1-c1ccc(cc1)C(=O)N1CCCCC1 |t:4|
Show InChI InChI=1S/C20H21ClN2O3/c21-14-6-9-16-17(12-14)20(26)23(19(16)25)15-7-4-13(5-8-15)18(24)22-10-2-1-3-11-22/h4-8,25-26H,1-3,9-12H2
PCBioAssay
n/an/an/an/a 9.02E+3n/an/an/an/a
NMMLSC
Curated by PubChem BioAssay
Assay Description
University of New Mexico Assay Overview: Assay Support: 1 X01 MH085707-01 Project Title: HTS for developing T Cell Immune Modulators Assay Provid...
PubChem Bioassay (2011)
BindingDB Entry DOI: 10.7270/Q2XW4H88