null
SMILES: Cc1ccnc(c1)N=CC(C#N)c1nc(cs1)-c1cccc(Br)c1
InChI Key: InChIKey=WJCYMWKSWGSRMO-UHFFFAOYSA-N
Activity Spreadsheet -- Enzyme Inhibition Constant Data from BindingDB
Found 1 hit for monomerid = 79672
Trg + Lig
Ki
nM
ΔG°
kcal/mole
IC50
nM
Kd
nM
EC50/IC50
nM
koff
s-1
kon
M-1s-1
pHTemp
°C
Tropomyosin alpha-1 chain
(Sus scrofa)
BDBM79672
((E)-2-[4-(3-bromophenyl)-1,3-thiazol-2-yl]-3-[(4-m...)
Show SMILES Cc1ccnc(c1)N=CC(C#N)c1nc(cs1)-c1cccc(Br)c1 |w:7.7|
Show InChI InChI=1S/C18H13BrN4S/c1-12-5-6-21-17(7-12)22-10-14(9-20)18-23-16(11-24-18)13-3-2-4-15(19)8-13/h2-8,10-11,14H,1H3
PCBioAssay
n/an/an/an/a 761n/an/an/an/a
The Scripps Research Institute Molecular Screening Center
Curated by PubChem BioAssay
Assay Description
Source (MLPCN Center Name): The Scripps Research Institute Molecular Screening Center (SRIMSC) Affiliation: The Scripps Research Institute, TSRI Assa...
PubChem Bioassay (2011)
BindingDB Entry DOI: 10.7270/Q21N7ZKB