BDBM7988 (3S,4S)-5-[(4-bromophenyl)methoxy]-N-[(1S)-1-{[(1S)-1-carbamoyl-3-methylbutyl]carbamoyl}ethyl]-3-hydroxy-4-[(2,4,6-trifluorophenyl)formamido]pentanamide::CHEMBL113331::N-{(1S,2S)-1-(4-Bromobenzyloxymethyl)-3-[(S)-1-((S)-1-carbamoyl-3-methylbutylcarbamoyl)ethylcarbamoyl]-2-hydroxypropyl}-2,4,6-trifluorobenzamide::Statine-like inhibitor 27
SMILES: CC(C)C[C@H](NC(=O)[C@H](C)NC(=O)C[C@H](O)[C@H](COCc1ccc(Br)cc1)NC(=O)c1c(F)cc(F)cc1F)C(N)=O
InChI Key: InChIKey=BTVFEHHDPWMSER-OBAATPRFSA-N
Data: 6 KI
Activity Spreadsheet -- Enzyme Inhibition Constant Data from BindingDB
Found 6 hits for monomerid = 7988
Trg + Lig
Ki
nM
ΔG°
kcal/mole
IC50
nM
Kd
nM
EC50/IC50
nM
koff
s-1
kon
M-1s-1
pHTemp
°C
Plasmepsin I
(Plasmodium falciparum)
BDBM7988
((3S,4S)-5-[(4-bromophenyl)methoxy]-N-[(1S)-1-{[(1S...)
Show SMILES CC(C)C[C@H](NC(=O)[C@H](C)NC(=O)C[C@H](O)[C@H](COCc1ccc(Br)cc1)NC(=O)c1c(F)cc(F)cc1F)C(N)=O |r|
Show InChI InChI=1S/C28H34BrF3N4O6/c1-14(2)8-21(26(33)39)35-27(40)15(3)34-24(38)11-23(37)22(13-42-12-16-4-6-17(29)7-5-16)36-28(41)25-19(31)9-18(30)10-20(25)32/h4-7,9-10,14-15,21-23,37H,8,11-13H2,1-3H3,(H2,33,39)(H,34,38)(H,35,40)(H,36,41)/t15-,21-,22-,23-/m0/s1
3.40n/an/an/an/an/an/an/an/a
Linkoping University
Assay Description
Enzyme activities were assayed by monitoring the hydrolysis of substrate in the presence or absence of inhibitor compounds. The hydrolysis was record...
J Med Chem 47: 3353-66 (2004)
Article DOI: 10.1021/jm031106i
BindingDB Entry DOI: 10.7270/Q2WM1BMG
Plasmepsin I
(Plasmodium falciparum)
BDBM7988
((3S,4S)-5-[(4-bromophenyl)methoxy]-N-[(1S)-1-{[(1S...)
Show SMILES CC(C)C[C@H](NC(=O)[C@H](C)NC(=O)C[C@H](O)[C@H](COCc1ccc(Br)cc1)NC(=O)c1c(F)cc(F)cc1F)C(N)=O |r|
Show InChI InChI=1S/C28H34BrF3N4O6/c1-14(2)8-21(26(33)39)35-27(40)15(3)34-24(38)11-23(37)22(13-42-12-16-4-6-17(29)7-5-16)36-28(41)25-19(31)9-18(30)10-20(25)32/h4-7,9-10,14-15,21-23,37H,8,11-13H2,1-3H3,(H2,33,39)(H,34,38)(H,35,40)(H,36,41)/t15-,21-,22-,23-/m0/s1
3.40n/an/an/an/an/an/an/an/a
Linköping University
Curated by ChEMBL
Assay Description
Inhibitory concentration against the Plasmepsin I of Plasmodium falciparum
J Med Chem 48: 4400-9 (2005)
Article DOI: 10.1021/jm040884n
BindingDB Entry DOI: 10.7270/Q2R78DRQ
Plasmepsin 2
(Plasmodium falciparum)
BDBM7988
((3S,4S)-5-[(4-bromophenyl)methoxy]-N-[(1S)-1-{[(1S...)
Show SMILES CC(C)C[C@H](NC(=O)[C@H](C)NC(=O)C[C@H](O)[C@H](COCc1ccc(Br)cc1)NC(=O)c1c(F)cc(F)cc1F)C(N)=O |r|
Show InChI InChI=1S/C28H34BrF3N4O6/c1-14(2)8-21(26(33)39)35-27(40)15(3)34-24(38)11-23(37)22(13-42-12-16-4-6-17(29)7-5-16)36-28(41)25-19(31)9-18(30)10-20(25)32/h4-7,9-10,14-15,21-23,37H,8,11-13H2,1-3H3,(H2,33,39)(H,34,38)(H,35,40)(H,36,41)/t15-,21-,22-,23-/m0/s1
10n/an/an/an/an/an/an/an/a
Linköping University
Curated by ChEMBL
Assay Description
Inhibitory concentration against the Plasmepsin II of Plasmodium falciparum
J Med Chem 48: 4400-9 (2005)
Article DOI: 10.1021/jm040884n
BindingDB Entry DOI: 10.7270/Q2R78DRQ
Plasmepsin 2
(Plasmodium falciparum)
BDBM7988
((3S,4S)-5-[(4-bromophenyl)methoxy]-N-[(1S)-1-{[(1S...)
Show SMILES CC(C)C[C@H](NC(=O)[C@H](C)NC(=O)C[C@H](O)[C@H](COCc1ccc(Br)cc1)NC(=O)c1c(F)cc(F)cc1F)C(N)=O |r|
Show InChI InChI=1S/C28H34BrF3N4O6/c1-14(2)8-21(26(33)39)35-27(40)15(3)34-24(38)11-23(37)22(13-42-12-16-4-6-17(29)7-5-16)36-28(41)25-19(31)9-18(30)10-20(25)32/h4-7,9-10,14-15,21-23,37H,8,11-13H2,1-3H3,(H2,33,39)(H,34,38)(H,35,40)(H,36,41)/t15-,21-,22-,23-/m0/s1
10 -10.8n/an/an/an/an/a4.522
Linkoping University
Assay Description
Enzyme activities were assayed by monitoring the hydrolysis of substrate in the presence or absence of inhibitor compounds. The hydrolysis was record...
J Med Chem 47: 3353-66 (2004)
Article DOI: 10.1021/jm031106i
BindingDB Entry DOI: 10.7270/Q2WM1BMG
Cathepsin D
(Homo sapiens (Human))
BDBM7988
((3S,4S)-5-[(4-bromophenyl)methoxy]-N-[(1S)-1-{[(1S...)
Show SMILES CC(C)C[C@H](NC(=O)[C@H](C)NC(=O)C[C@H](O)[C@H](COCc1ccc(Br)cc1)NC(=O)c1c(F)cc(F)cc1F)C(N)=O |r|
Show InChI InChI=1S/C28H34BrF3N4O6/c1-14(2)8-21(26(33)39)35-27(40)15(3)34-24(38)11-23(37)22(13-42-12-16-4-6-17(29)7-5-16)36-28(41)25-19(31)9-18(30)10-20(25)32/h4-7,9-10,14-15,21-23,37H,8,11-13H2,1-3H3,(H2,33,39)(H,34,38)(H,35,40)(H,36,41)/t15-,21-,22-,23-/m0/s1
NCI pathway
Reactome pathway
>4.00E+3n/an/an/an/an/an/an/an/a
Linköping University
Curated by ChEMBL
Assay Description
Inhibitory concentration against the human Cathepsin D
J Med Chem 48: 4400-9 (2005)
Article DOI: 10.1021/jm040884n
BindingDB Entry DOI: 10.7270/Q2R78DRQ
Cathepsin D
(Homo sapiens (Human))
BDBM7988
((3S,4S)-5-[(4-bromophenyl)methoxy]-N-[(1S)-1-{[(1S...)
Show SMILES CC(C)C[C@H](NC(=O)[C@H](C)NC(=O)C[C@H](O)[C@H](COCc1ccc(Br)cc1)NC(=O)c1c(F)cc(F)cc1F)C(N)=O |r|
Show InChI InChI=1S/C28H34BrF3N4O6/c1-14(2)8-21(26(33)39)35-27(40)15(3)34-24(38)11-23(37)22(13-42-12-16-4-6-17(29)7-5-16)36-28(41)25-19(31)9-18(30)10-20(25)32/h4-7,9-10,14-15,21-23,37H,8,11-13H2,1-3H3,(H2,33,39)(H,34,38)(H,35,40)(H,36,41)/t15-,21-,22-,23-/m0/s1
NCI pathway
Reactome pathway
>4.00E+3n/an/an/an/an/an/an/an/a
Linkoping University
Assay Description
Enzyme activities were assayed by monitoring the hydrolysis of substrate in the presence or absence of inhibitor compounds. The hydrolysis was record...
J Med Chem 47: 3353-66 (2004)
Article DOI: 10.1021/jm031106i
BindingDB Entry DOI: 10.7270/Q2WM1BMG