BDBM8005 (2R,3R,4R,5R)-2,5-bis({[(2E)-3-(4-acetylphenyl)prop-2-en-1-yl]oxy})-3,4-dihydroxy-N,N'-bis[(1S,2R)-2-hydroxy-2,3-dihydro-1H-inden-1-yl]hexanediamide::C2-symmetric compound 13
SMILES: CC(=O)c1ccc(\C=C\CO[C@H]([C@H](O)[C@@H](O)[C@@H](OC\C=C\c2ccc(cc2)C(C)=O)C(=O)N[C@@H]2[C@H](O)Cc3ccccc23)C(=O)N[C@@H]2[C@H](O)Cc3ccccc23)cc1
InChI Key: InChIKey=WZXYHEYYJRGWNR-VVKCFMERSA-N
Data: 6 KI
Activity Spreadsheet -- Enzyme Inhibition Constant Data from BindingDB
Found 6 hits for monomerid = 8005
Trg + Lig
Ki
nM
ΔG°
kcal/mole
IC50
nM
Kd
nM
EC50/IC50
nM
koff
s-1
kon
M-1s-1
pHTemp
°C
Plasmepsin I
(Plasmodium falciparum)
BDBM8005
((2R,3R,4R,5R)-2,5-bis({[(2E)-3-(4-acetylphenyl)pro...)
Show SMILES CC(=O)c1ccc(\C=C\CO[C@H]([C@H](O)[C@@H](O)[C@@H](OC\C=C\c2ccc(cc2)C(C)=O)C(=O)N[C@@H]2[C@H](O)Cc3ccccc23)C(=O)N[C@@H]2[C@H](O)Cc3ccccc23)cc1 |r|
Show InChI InChI=1S/C46H48N2O10/c1-27(49)31-19-15-29(16-20-31)9-7-23-57-43(45(55)47-39-35-13-5-3-11-33(35)25-37(39)51)41(53)42(54)44(58-24-8-10-30-17-21-32(22-18-30)28(2)50)46(56)48-40-36-14-6-4-12-34(36)26-38(40)52/h3-22,37-44,51-54H,23-26H2,1-2H3,(H,47,55)(H,48,56)/b9-7+,10-8+/t37-,38-,39+,40+,41-,42-,43-,44-/m1/s1
0.800n/an/an/an/an/an/an/an/a
Uppsala University
Assay Description
Enzyme activities were assayed by monitoring the hydrolysis of substrate in the presence or absence of inhibitor compounds. The hydrolysis was record...
J Med Chem 47: 110-22 (2004)
Article DOI: 10.1021/jm030933g
BindingDB Entry DOI: 10.7270/Q2RV0KX6
Plasmepsin I
(Plasmodium falciparum)
BDBM8005
((2R,3R,4R,5R)-2,5-bis({[(2E)-3-(4-acetylphenyl)pro...)
Show SMILES CC(=O)c1ccc(\C=C\CO[C@H]([C@H](O)[C@@H](O)[C@@H](OC\C=C\c2ccc(cc2)C(C)=O)C(=O)N[C@@H]2[C@H](O)Cc3ccccc23)C(=O)N[C@@H]2[C@H](O)Cc3ccccc23)cc1 |r|
Show InChI InChI=1S/C46H48N2O10/c1-27(49)31-19-15-29(16-20-31)9-7-23-57-43(45(55)47-39-35-13-5-3-11-33(35)25-37(39)51)41(53)42(54)44(58-24-8-10-30-17-21-32(22-18-30)28(2)50)46(56)48-40-36-14-6-4-12-34(36)26-38(40)52/h3-22,37-44,51-54H,23-26H2,1-2H3,(H,47,55)(H,48,56)/b9-7+,10-8+/t37-,38-,39+,40+,41-,42-,43-,44-/m1/s1
0.800n/an/an/an/an/an/an/an/a
University of Zambia
Curated by ChEMBL
Assay Description
Inhibition of recombinant Plasmodium falciparum Plasmepsin 1
J Med Chem 63: 4445-4467 (2020)
Article DOI: 10.1021/acs.jmedchem.9b01622
Plasmepsin 2
(Plasmodium falciparum)
BDBM8005
((2R,3R,4R,5R)-2,5-bis({[(2E)-3-(4-acetylphenyl)pro...)
Show SMILES CC(=O)c1ccc(\C=C\CO[C@H]([C@H](O)[C@@H](O)[C@@H](OC\C=C\c2ccc(cc2)C(C)=O)C(=O)N[C@@H]2[C@H](O)Cc3ccccc23)C(=O)N[C@@H]2[C@H](O)Cc3ccccc23)cc1 |r|
Show InChI InChI=1S/C46H48N2O10/c1-27(49)31-19-15-29(16-20-31)9-7-23-57-43(45(55)47-39-35-13-5-3-11-33(35)25-37(39)51)41(53)42(54)44(58-24-8-10-30-17-21-32(22-18-30)28(2)50)46(56)48-40-36-14-6-4-12-34(36)26-38(40)52/h3-22,37-44,51-54H,23-26H2,1-2H3,(H,47,55)(H,48,56)/b9-7+,10-8+/t37-,38-,39+,40+,41-,42-,43-,44-/m1/s1
6 -11.1n/an/an/an/an/a4.522
Uppsala University
Assay Description
Enzyme activities were assayed by monitoring the hydrolysis of substrate in the presence or absence of inhibitor compounds. The hydrolysis was record...
J Med Chem 47: 110-22 (2004)
Article DOI: 10.1021/jm030933g
BindingDB Entry DOI: 10.7270/Q2RV0KX6
Plasmepsin 2
(Plasmodium falciparum)
BDBM8005
((2R,3R,4R,5R)-2,5-bis({[(2E)-3-(4-acetylphenyl)pro...)
Show SMILES CC(=O)c1ccc(\C=C\CO[C@H]([C@H](O)[C@@H](O)[C@@H](OC\C=C\c2ccc(cc2)C(C)=O)C(=O)N[C@@H]2[C@H](O)Cc3ccccc23)C(=O)N[C@@H]2[C@H](O)Cc3ccccc23)cc1 |r|
Show InChI InChI=1S/C46H48N2O10/c1-27(49)31-19-15-29(16-20-31)9-7-23-57-43(45(55)47-39-35-13-5-3-11-33(35)25-37(39)51)41(53)42(54)44(58-24-8-10-30-17-21-32(22-18-30)28(2)50)46(56)48-40-36-14-6-4-12-34(36)26-38(40)52/h3-22,37-44,51-54H,23-26H2,1-2H3,(H,47,55)(H,48,56)/b9-7+,10-8+/t37-,38-,39+,40+,41-,42-,43-,44-/m1/s1
6n/an/an/an/an/an/an/an/a
University of Zambia
Curated by ChEMBL
Assay Description
Inhibition of recombinant Plasmodium falciparum Plasmepsin 2
J Med Chem 63: 4445-4467 (2020)
Article DOI: 10.1021/acs.jmedchem.9b01622
Cathepsin D
(Homo sapiens (Human))
BDBM8005
((2R,3R,4R,5R)-2,5-bis({[(2E)-3-(4-acetylphenyl)pro...)
Show SMILES CC(=O)c1ccc(\C=C\CO[C@H]([C@H](O)[C@@H](O)[C@@H](OC\C=C\c2ccc(cc2)C(C)=O)C(=O)N[C@@H]2[C@H](O)Cc3ccccc23)C(=O)N[C@@H]2[C@H](O)Cc3ccccc23)cc1 |r|
Show InChI InChI=1S/C46H48N2O10/c1-27(49)31-19-15-29(16-20-31)9-7-23-57-43(45(55)47-39-35-13-5-3-11-33(35)25-37(39)51)41(53)42(54)44(58-24-8-10-30-17-21-32(22-18-30)28(2)50)46(56)48-40-36-14-6-4-12-34(36)26-38(40)52/h3-22,37-44,51-54H,23-26H2,1-2H3,(H,47,55)(H,48,56)/b9-7+,10-8+/t37-,38-,39+,40+,41-,42-,43-,44-/m1/s1
NCI pathway
Reactome pathway
>200n/an/an/an/an/an/an/an/a
University of Zambia
Curated by ChEMBL
Assay Description
Inhibition of human cathepsin D
J Med Chem 63: 4445-4467 (2020)
Article DOI: 10.1021/acs.jmedchem.9b01622
Cathepsin D
(Homo sapiens (Human))
BDBM8005
((2R,3R,4R,5R)-2,5-bis({[(2E)-3-(4-acetylphenyl)pro...)
Show SMILES CC(=O)c1ccc(\C=C\CO[C@H]([C@H](O)[C@@H](O)[C@@H](OC\C=C\c2ccc(cc2)C(C)=O)C(=O)N[C@@H]2[C@H](O)Cc3ccccc23)C(=O)N[C@@H]2[C@H](O)Cc3ccccc23)cc1 |r|
Show InChI InChI=1S/C46H48N2O10/c1-27(49)31-19-15-29(16-20-31)9-7-23-57-43(45(55)47-39-35-13-5-3-11-33(35)25-37(39)51)41(53)42(54)44(58-24-8-10-30-17-21-32(22-18-30)28(2)50)46(56)48-40-36-14-6-4-12-34(36)26-38(40)52/h3-22,37-44,51-54H,23-26H2,1-2H3,(H,47,55)(H,48,56)/b9-7+,10-8+/t37-,38-,39+,40+,41-,42-,43-,44-/m1/s1
NCI pathway
Reactome pathway
>2.00E+3n/an/an/an/an/an/an/an/a
Uppsala University
Assay Description
Enzyme activities were assayed by monitoring the hydrolysis of substrate in the presence or absence of inhibitor compounds. The hydrolysis was record...
J Med Chem 47: 110-22 (2004)
Article DOI: 10.1021/jm030933g
BindingDB Entry DOI: 10.7270/Q2RV0KX6