BDBM8007 (2R,3R,4R,5R)-2,5-bis({[(2E)-3-(2H-1,3-benzodioxol-5-yl)prop-2-en-1-yl]oxy})-3,4-dihydroxy-N,N'-bis[(1S,2R)-2-hydroxy-2,3-dihydro-1H-inden-1-yl]hexanediamide::(2R,3R,4R,5R)-N1,N6-Bis[(1S,2R)-2-hydroxy-1-indanyl]-2,5-bis[(2E)-3-(3,4-methylenedioxyphenyl)-2-propenyloxy]-3,4-dihydroxyhexane-1,6-diamide::C2-symmetric compound 15
SMILES: O[C@H]([C@@H](O)[C@@H](OC\C=C\c1ccc2OCOc2c1)C(=O)N[C@@H]1[C@H](O)Cc2ccccc12)[C@@H](OC\C=C\c1ccc2OCOc2c1)C(=O)N[C@@H]1[C@H](O)Cc2ccccc12
InChI Key: InChIKey=YQPHDXFNFIMJRH-QSERKKIGSA-N
Data: 3 KI
Activity Spreadsheet -- Enzyme Inhibition Constant Data from BindingDB
Found 3 hits for monomerid = 8007
Trg + Lig
Ki
nM
ΔG°
kcal/mole
IC50
nM
Kd
nM
EC50/IC50
nM
koff
s-1
kon
M-1s-1
pHTemp
°C
Plasmepsin I
(Plasmodium falciparum)
BDBM8007
((2R,3R,4R,5R)-2,5-bis({[(2E)-3-(2H-1,3-benzodioxol...)
Show SMILES O[C@H]([C@@H](O)[C@@H](OC\C=C\c1ccc2OCOc2c1)C(=O)N[C@@H]1[C@H](O)Cc2ccccc12)[C@@H](OC\C=C\c1ccc2OCOc2c1)C(=O)N[C@@H]1[C@H](O)Cc2ccccc12 |r|
Show InChI InChI=1S/C44H44N2O12/c47-31-21-27-9-1-3-11-29(27)37(31)45-43(51)41(53-17-5-7-25-13-15-33-35(19-25)57-23-55-33)39(49)40(50)42(44(52)46-38-30-12-4-2-10-28(30)22-32(38)48)54-18-6-8-26-14-16-34-36(20-26)58-24-56-34/h1-16,19-20,31-32,37-42,47-50H,17-18,21-24H2,(H,45,51)(H,46,52)/b7-5+,8-6+/t31-,32-,37+,38+,39-,40-,41-,42-/m1/s1
0.5n/an/an/an/an/an/an/an/a
Uppsala University
Assay Description
Enzyme activities were assayed by monitoring the hydrolysis of substrate in the presence or absence of inhibitor compounds. The hydrolysis was record...
J Med Chem 47: 110-22 (2004)
Article DOI: 10.1021/jm030933g
BindingDB Entry DOI: 10.7270/Q2RV0KX6
Plasmepsin 2
(Plasmodium falciparum)
BDBM8007
((2R,3R,4R,5R)-2,5-bis({[(2E)-3-(2H-1,3-benzodioxol...)
Show SMILES O[C@H]([C@@H](O)[C@@H](OC\C=C\c1ccc2OCOc2c1)C(=O)N[C@@H]1[C@H](O)Cc2ccccc12)[C@@H](OC\C=C\c1ccc2OCOc2c1)C(=O)N[C@@H]1[C@H](O)Cc2ccccc12 |r|
Show InChI InChI=1S/C44H44N2O12/c47-31-21-27-9-1-3-11-29(27)37(31)45-43(51)41(53-17-5-7-25-13-15-33-35(19-25)57-23-55-33)39(49)40(50)42(44(52)46-38-30-12-4-2-10-28(30)22-32(38)48)54-18-6-8-26-14-16-34-36(20-26)58-24-56-34/h1-16,19-20,31-32,37-42,47-50H,17-18,21-24H2,(H,45,51)(H,46,52)/b7-5+,8-6+/t31-,32-,37+,38+,39-,40-,41-,42-/m1/s1
14 -10.6n/an/an/an/an/a4.522
Uppsala University
Assay Description
Enzyme activities were assayed by monitoring the hydrolysis of substrate in the presence or absence of inhibitor compounds. The hydrolysis was record...
J Med Chem 47: 110-22 (2004)
Article DOI: 10.1021/jm030933g
BindingDB Entry DOI: 10.7270/Q2RV0KX6
Cathepsin D
(Homo sapiens (Human))
BDBM8007
((2R,3R,4R,5R)-2,5-bis({[(2E)-3-(2H-1,3-benzodioxol...)
Show SMILES O[C@H]([C@@H](O)[C@@H](OC\C=C\c1ccc2OCOc2c1)C(=O)N[C@@H]1[C@H](O)Cc2ccccc12)[C@@H](OC\C=C\c1ccc2OCOc2c1)C(=O)N[C@@H]1[C@H](O)Cc2ccccc12 |r|
Show InChI InChI=1S/C44H44N2O12/c47-31-21-27-9-1-3-11-29(27)37(31)45-43(51)41(53-17-5-7-25-13-15-33-35(19-25)57-23-55-33)39(49)40(50)42(44(52)46-38-30-12-4-2-10-28(30)22-32(38)48)54-18-6-8-26-14-16-34-36(20-26)58-24-56-34/h1-16,19-20,31-32,37-42,47-50H,17-18,21-24H2,(H,45,51)(H,46,52)/b7-5+,8-6+/t31-,32-,37+,38+,39-,40-,41-,42-/m1/s1
NCI pathway
Reactome pathway
>2.00E+3n/an/an/an/an/an/an/an/a
Uppsala University
Assay Description
Enzyme activities were assayed by monitoring the hydrolysis of substrate in the presence or absence of inhibitor compounds. The hydrolysis was record...
J Med Chem 47: 110-22 (2004)
Article DOI: 10.1021/jm030933g
BindingDB Entry DOI: 10.7270/Q2RV0KX6