BDBM80350 MLS000030849::N-(2-hydroxy-5-phenyl-phenyl)acetamide::N-(2-hydroxy-5-phenylphenyl)acetamide::N-(2-oxidanyl-5-phenyl-phenyl)ethanamide::N-(4-Hydroxy-biphenyl-3-yl)-acetamide::SMR000010843::cid_79419
SMILES: CC(=O)Nc1cc(ccc1O)-c1ccccc1
InChI Key: InChIKey=ODBZGVNPNRYIIU-UHFFFAOYSA-N
Data: 3 IC50
Activity Spreadsheet -- Enzyme Inhibition Constant Data from BindingDB
Found 3 hits for monomerid = 80350
Trg + Lig
Ki
nM
ΔG°
kcal/mole
IC50
nM
Kd
nM
EC50/IC50
nM
koff
s-1
kon
M-1s-1
pHTemp
°C
DNA dC->dU-editing enzyme APOBEC-3G
(Homo sapiens (Human))
BDBM80350
(MLS000030849 | N-(2-hydroxy-5-phenyl-phenyl)acetam...)
Show SMILES CC(=O)Nc1cc(ccc1O)-c1ccccc1
Show InChI InChI=1S/C14H13NO2/c1-10(16)15-13-9-12(7-8-14(13)17)11-5-3-2-4-6-11/h2-9,17H,1H3,(H,15,16)
PCBioAssay
n/an/a 1.65E+4n/an/an/an/an/a25
Burnham Center for Chemical Genomics
Curated by PubChem BioAssay
Assay Description
Data Source: Sanford-Burnham Center for Chemical Genomics (SBCCG) Source Affiliation: Sanford-Burnham Medical Research Institute (SBMRI, San Diego, C...
PubChem Bioassay (2011)
BindingDB Entry DOI: 10.7270/Q2862DX0
Cereblon/Histone deacetylase 1
(Homo sapiens (Human))
BDBM80350
(MLS000030849 | N-(2-hydroxy-5-phenyl-phenyl)acetam...)
Show SMILES CC(=O)Nc1cc(ccc1O)-c1ccccc1
Show InChI InChI=1S/C14H13NO2/c1-10(16)15-13-9-12(7-8-14(13)17)11-5-3-2-4-6-11/h2-9,17H,1H3,(H,15,16)
NCI pathway
Reactome pathway
n/an/a 4.80E+3n/an/an/an/an/an/a
Merck Research Laboratories
Curated by ChEMBL
Assay Description
Inhibition of HDAC1
Bioorg Med Chem Lett 18: 973-8 (2008)
Article DOI: 10.1016/j.bmcl.2007.12.031
BindingDB Entry DOI: 10.7270/Q2765G5S
probable DNA dC->dU-editing enzyme APOBEC-3A
(Homo sapiens (Human))
BDBM80350
(MLS000030849 | N-(2-hydroxy-5-phenyl-phenyl)acetam...)
Show SMILES CC(=O)Nc1cc(ccc1O)-c1ccccc1
Show InChI InChI=1S/C14H13NO2/c1-10(16)15-13-9-12(7-8-14(13)17)11-5-3-2-4-6-11/h2-9,17H,1H3,(H,15,16)
PCBioAssay
n/an/a 7.17E+3n/an/an/an/an/a25
Burnham Center for Chemical Genomics
Curated by PubChem BioAssay
Assay Description
Data Source: Sanford-Burnham Center for Chemical Genomics (SBCCG) Source Affiliation: Sanford-Burnham Medical Research Institute (SBMRI, San Diego, C...
PubChem Bioassay (2011)
BindingDB Entry DOI: 10.7270/Q24F1P6P