BDBM8040 2-Anilino-4-(thiazol-5-yl)pyrimidine deriv. 11::4-(2,4-dimethyl-1,3-thiazol-5-yl)-N-phenylpyrimidin-2-amine::[4-(2,4-Dimethylthiazol-5-yl)-pyrimidin-2-yl]phenylamine
SMILES: Cc1nc(C)c(s1)-c1ccnc(Nc2ccccc2)n1
InChI Key: InChIKey=CKJOPHUBYHDSMD-UHFFFAOYSA-N
Data: 2 KI
PDB links: 5 PDB IDs contain this monomer as substructures. 5 PDB IDs contain inhibitors having a similarity of 90% to this monomer.
Activity Spreadsheet -- Enzyme Inhibition Constant Data from BindingDB
Found 2 hits for monomerid = 8040
Trg + Lig
Ki
nM
ΔG°
kcal/mole
IC50
nM
Kd
nM
EC50/IC50
nM
koff
s-1
kon
M-1s-1
pHTemp
°C
CDK2/CycE
(Homo sapiens (Human))
BDBM8040
(2-Anilino-4-(thiazol-5-yl)pyrimidine deriv. 11 | 4...)
Show SMILES Cc1nc(C)c(s1)-c1ccnc(Nc2ccccc2)n1
Show InChI InChI=1S/C15H14N4S/c1-10-14(20-11(2)17-10)13-8-9-16-15(19-13)18-12-6-4-3-5-7-12/h3-9H,1-2H3,(H,16,18,19)
80 -9.84n/an/an/an/an/a7.430
Cyclacel Limited
Assay Description
In vitro kinase assay using purified enzyme, was incubated at 30 °C with substrate, and test compounds in the presence of 100 uM ATP/ [gamma-32P...
J Med Chem 47: 1662-75 (2004)
Article DOI: 10.1021/jm0309957
BindingDB Entry DOI: 10.7270/Q2H993DD
Cyclin-Dependent Kinase 4 (CDK4)
(Homo sapiens (Human))
BDBM8040
(2-Anilino-4-(thiazol-5-yl)pyrimidine deriv. 11 | 4...)
Show SMILES Cc1nc(C)c(s1)-c1ccnc(Nc2ccccc2)n1
Show InChI InChI=1S/C15H14N4S/c1-10-14(20-11(2)17-10)13-8-9-16-15(19-13)18-12-6-4-3-5-7-12/h3-9H,1-2H3,(H,16,18,19)
NCI pathway
Reactome pathway
2.60E+3 -7.74n/an/an/an/an/an/a30
Cyclacel Limited
Assay Description
In vitro kinase assay using purified enzyme, was incubated at 30 °C with substrate, and test compounds in the presence of 100 uM ATP/ [gamma-32P...
J Med Chem 47: 1662-75 (2004)
Article DOI: 10.1021/jm0309957
BindingDB Entry DOI: 10.7270/Q2H993DD