BDBM80434 MLS000705802::N-(4,5-dihydro-1H-imidazol-2-yl)-N-{2-[(2-fluorophenyl)sulfanyl]benzyl}amine::N-[[2-(2-fluorophenyl)sulfanylphenyl]methyl]-4,5-dihydro-1H-imidazol-2-amine;hydroiodide::N-[[2-[(2-fluorophenyl)thio]phenyl]methyl]-4,5-dihydro-1H-imidazol-2-amine;hydroiodide::SMR000224867::[2-[(2-fluorophenyl)thio]benzyl]-(2-imidazolin-2-yl)amine;hydroiodide::cid_15945714
SMILES: Fc1ccccc1-[#16]-c1ccccc1-[#6]\[#7]=[#6]-1\[#7]-[#6]-[#6]-[#7]-1
InChI Key: InChIKey=ACDQXIPSEPODOU-UHFFFAOYSA-N
Data: 3 IC50
Activity Spreadsheet -- Enzyme Inhibition Constant Data from BindingDB
Found 3 hits for monomerid = 80434
Trg + Lig
Ki
nM
ΔG°
kcal/mole
IC50
nM
Kd
nM
EC50/IC50
nM
koff
s-1
kon
M-1s-1
pHTemp
°C
probable DNA dC->dU-editing enzyme APOBEC-3A
(Homo sapiens (Human))
BDBM80434
(MLS000705802 | N-(4,5-dihydro-1H-imidazol-2-yl)-N-...)
Show SMILES Fc1ccccc1-[#16]-c1ccccc1-[#6]\[#7]=[#6]-1\[#7]-[#6]-[#6]-[#7]-1
Show InChI InChI=1S/C16H16FN3S/c17-13-6-2-4-8-15(13)21-14-7-3-1-5-12(14)11-20-16-18-9-10-19-16/h1-8H,9-11H2,(H2,18,19,20)
PCBioAssay
n/an/a 1.35E+3n/an/an/an/an/a25
Burnham Center for Chemical Genomics
Curated by PubChem BioAssay
Assay Description
Data Source: Sanford-Burnham Center for Chemical Genomics (SBCCG) Source Affiliation: Sanford-Burnham Medical Research Institute (SBMRI, San Diego, C...
PubChem Bioassay (2011)
BindingDB Entry DOI: 10.7270/Q24F1P6P
carboxy-terminal domain RNA polymerase II polypeptide A small phosphatase 1 isoform 1
(Homo sapiens (Human))
BDBM80434
(MLS000705802 | N-(4,5-dihydro-1H-imidazol-2-yl)-N-...)
Show SMILES Fc1ccccc1-[#16]-c1ccccc1-[#6]\[#7]=[#6]-1\[#7]-[#6]-[#6]-[#7]-1
Show InChI InChI=1S/C16H16FN3S/c17-13-6-2-4-8-15(13)21-14-7-3-1-5-12(14)11-20-16-18-9-10-19-16/h1-8H,9-11H2,(H2,18,19,20)
PCBioAssay
n/an/a 4.12E+3n/an/an/an/an/an/a
Burnham Center for Chemical Genomics
Curated by PubChem BioAssay
Assay Description
Data Source: Sanford-Burnham Center for Chemical Genomics (SBCCG) Source Affiliation: Sanford-Burnham Medical Research Institute (SBMRI, San Diego, C...
PubChem Bioassay (2011)
BindingDB Entry DOI: 10.7270/Q2V986KM
DNA dC->dU-editing enzyme APOBEC-3G
(Homo sapiens (Human))
BDBM80434
(MLS000705802 | N-(4,5-dihydro-1H-imidazol-2-yl)-N-...)
Show SMILES Fc1ccccc1-[#16]-c1ccccc1-[#6]\[#7]=[#6]-1\[#7]-[#6]-[#6]-[#7]-1
Show InChI InChI=1S/C16H16FN3S/c17-13-6-2-4-8-15(13)21-14-7-3-1-5-12(14)11-20-16-18-9-10-19-16/h1-8H,9-11H2,(H2,18,19,20)
PCBioAssay
n/an/a 2.77E+3n/an/an/an/an/a25
Burnham Center for Chemical Genomics
Curated by PubChem BioAssay
Assay Description
Data Source: Sanford-Burnham Center for Chemical Genomics (SBCCG) Source Affiliation: Sanford-Burnham Medical Research Institute (SBMRI, San Diego, C...
PubChem Bioassay (2011)
BindingDB Entry DOI: 10.7270/Q2862DX0