BDBM8047 2-Anilino-4-(thiazol-5-yl)pyrimidine deriv. 18::4-(2,4-dimethyl-1,3-thiazol-5-yl)-N-[2-(trifluoromethyl)phenyl]pyrimidin-2-amine::[4-(2,4-Dimethylthiazol-5-yl)pyrimidin-2-yl]-(2-trifluoromethylphenyl)amine
SMILES: Cc1nc(C)c(s1)-c1ccnc(Nc2ccccc2C(F)(F)F)n1
InChI Key: InChIKey=IMTFOOWOQIKQFL-UHFFFAOYSA-N
Data: 2 KI
PDB links: 4 PDB IDs contain inhibitors having a similarity of 90% to this monomer.
Activity Spreadsheet -- Enzyme Inhibition Constant Data from BindingDB
Found 2 hits for monomerid = 8047
Trg + Lig
Ki
nM
ΔG°
kcal/mole
IC50
nM
Kd
nM
EC50/IC50
nM
koff
s-1
kon
M-1s-1
pHTemp
°C
Cyclin-Dependent Kinase 4 (CDK4)
(Homo sapiens (Human))
BDBM8047
(2-Anilino-4-(thiazol-5-yl)pyrimidine deriv. 18 | 4...)
Show SMILES Cc1nc(C)c(s1)-c1ccnc(Nc2ccccc2C(F)(F)F)n1
Show InChI InChI=1S/C16H13F3N4S/c1-9-14(24-10(2)21-9)13-7-8-20-15(23-13)22-12-6-4-3-5-11(12)16(17,18)19/h3-8H,1-2H3,(H,20,22,23)
NCI pathway
Reactome pathway
>2.00E+4>-6.51n/an/an/an/an/an/a30
Cyclacel Limited
Assay Description
In vitro kinase assay using purified enzyme, was incubated at 30 °C with substrate, and test compounds in the presence of 100 uM ATP/ [gamma-32P...
J Med Chem 47: 1662-75 (2004)
Article DOI: 10.1021/jm0309957
BindingDB Entry DOI: 10.7270/Q2H993DD
CDK2/CycE
(Homo sapiens (Human))
BDBM8047
(2-Anilino-4-(thiazol-5-yl)pyrimidine deriv. 18 | 4...)
Show SMILES Cc1nc(C)c(s1)-c1ccnc(Nc2ccccc2C(F)(F)F)n1
Show InChI InChI=1S/C16H13F3N4S/c1-9-14(24-10(2)21-9)13-7-8-20-15(23-13)22-12-6-4-3-5-11(12)16(17,18)19/h3-8H,1-2H3,(H,20,22,23)
>2.00E+4>-6.51n/an/an/an/an/a7.430
Cyclacel Limited
Assay Description
In vitro kinase assay using purified enzyme, was incubated at 30 °C with substrate, and test compounds in the presence of 100 uM ATP/ [gamma-32P...
J Med Chem 47: 1662-75 (2004)
Article DOI: 10.1021/jm0309957
BindingDB Entry DOI: 10.7270/Q2H993DD