null
SMILES: Clc1cccc(NC2=NN=C(CS2)c2ccc3OCCOc3c2)c1
InChI Key: InChIKey=CSAMKEFXMCEIOG-UHFFFAOYSA-N
Activity Spreadsheet -- Enzyme Inhibition Constant Data from BindingDB
Found 2 hits for monomerid = 80773
Trg + Lig
Ki
nM
ΔG°
kcal/mole
IC50
nM
Kd
nM
EC50/IC50
nM
koff
s-1
kon
M-1s-1
pHTemp
°C
Hexokinase-1
(Homo sapiens (Human))
BDBM80773
((3-chlorophenyl)-[5-(2,3-dihydro-1,4-benzodioxin-6...)
Show SMILES Clc1cccc(NC2=NN=C(CS2)c2ccc3OCCOc3c2)c1 |c:9,t:7|
Show InChI InChI=1S/C17H14ClN3O2S/c18-12-2-1-3-13(9-12)19-17-21-20-14(10-24-17)11-4-5-15-16(8-11)23-7-6-22-15/h1-5,8-9H,6-7,10H2,(H,19,21)
NCI pathway
Reactome pathway
PCBioAssay
n/an/an/an/a 4.13E+4n/an/an/an/a
Burnham Center for Chemical Genomics
Curated by PubChem BioAssay
Assay Description
Data Source: Sanford-Burnham Center for Chemical Genomics (SBCCG) Source Affiliation: Sanford-Burnham Medical Research Institute (SBMRI, San Diego, C...
PubChem Bioassay (2011)
BindingDB Entry DOI: 10.7270/Q2765CSM
Hexokinase HKDC1 [W721R]
(Homo sapiens (Human))
BDBM80773
((3-chlorophenyl)-[5-(2,3-dihydro-1,4-benzodioxin-6...)
Show SMILES Clc1cccc(NC2=NN=C(CS2)c2ccc3OCCOc3c2)c1 |c:9,t:7|
Show InChI InChI=1S/C17H14ClN3O2S/c18-12-2-1-3-13(9-12)19-17-21-20-14(10-24-17)11-4-5-15-16(8-11)23-7-6-22-15/h1-5,8-9H,6-7,10H2,(H,19,21)
PCBioAssay
n/an/an/an/a 2.32E+4n/an/an/an/a
Burnham Center for Chemical Genomics
Curated by PubChem BioAssay
Assay Description
Data Source: Sanford-Burnham Center for Chemical Genomics (SBCCG) Source Affiliation: Sanford-Burnham Medical Research Institute (SBMRI, San Diego, C...
PubChem Bioassay (2011)
BindingDB Entry DOI: 10.7270/Q2R78CQV