BDBM80781 (5E)-5-(2-anilino-4H-1,3,4-thiadiazin-5-ylidene)-2,4-dimethyl-3-pyrrolecarboxylic acid ethyl ester::(5E)-5-(2-anilino-4H-1,3,4-thiadiazin-5-ylidene)-2,4-dimethyl-pyrrole-3-carboxylic acid ethyl ester::MLS000335157::SMR000249915::cid_6099324::ethyl (5E)-2,4-dimethyl-5-(2-phenylazanyl-4H-1,3,4-thiadiazin-5-ylidene)pyrrole-3-carboxylate::ethyl (5E)-5-(2-anilino-4H-1,3,4-thiadiazin-5-ylidene)-2,4-dimethylpyrrole-3-carboxylate
SMILES: CCOC(=O)c1c(C)[nH]c(c1C)C1=NN=C(Nc2ccccc2)SC1
InChI Key: InChIKey=HKZRQNAKIFHTMK-UHFFFAOYSA-N
Data: 2 EC50
Activity Spreadsheet -- Enzyme Inhibition Constant Data from BindingDB
Found 2 hits for monomerid = 80781
Trg + Lig
Ki
nM
ΔG°
kcal/mole
IC50
nM
Kd
nM
EC50/IC50
nM
koff
s-1
kon
M-1s-1
pHTemp
°C
Hexokinase type I
(Homo sapiens (Human))
BDBM80781
((5E)-5-(2-anilino-4H-1,3,4-thiadiazin-5-ylidene)-2...)
Show SMILES CCOC(=O)c1c(C)[nH]c(c1C)C1=NN=C(Nc2ccccc2)SC1 |t:13,15|
Show InChI InChI=1S/C18H20N4O2S/c1-4-24-17(23)15-11(2)16(19-12(15)3)14-10-25-18(22-21-14)20-13-8-6-5-7-9-13/h5-9,19H,4,10H2,1-3H3,(H,20,22)
NCI pathway
Reactome pathway
PCBioAssay
n/an/an/an/a 1.82E+4n/an/an/an/a
Burnham Center for Chemical Genomics
Curated by PubChem BioAssay
Assay Description
Data Source: Sanford-Burnham Center for Chemical Genomics (SBCCG) Source Affiliation: Sanford-Burnham Medical Research Institute (SBMRI, San Diego, C...
PubChem Bioassay (2011)
BindingDB Entry DOI: 10.7270/Q2765CSM
putative hexokinase HKDC1
(Homo sapiens (Human))
BDBM80781
((5E)-5-(2-anilino-4H-1,3,4-thiadiazin-5-ylidene)-2...)
Show SMILES CCOC(=O)c1c(C)[nH]c(c1C)C1=NN=C(Nc2ccccc2)SC1 |t:13,15|
Show InChI InChI=1S/C18H20N4O2S/c1-4-24-17(23)15-11(2)16(19-12(15)3)14-10-25-18(22-21-14)20-13-8-6-5-7-9-13/h5-9,19H,4,10H2,1-3H3,(H,20,22)
PCBioAssay
n/an/an/an/a 2.43E+4n/an/an/an/a
Burnham Center for Chemical Genomics
Curated by PubChem BioAssay
Assay Description
Data Source: Sanford-Burnham Center for Chemical Genomics (SBCCG) Source Affiliation: Sanford-Burnham Medical Research Institute (SBMRI, San Diego, C...
PubChem Bioassay (2011)
BindingDB Entry DOI: 10.7270/Q2R78CQV