BDBM80901 2-[(1-ketoisochroman-3-carbonyl)amino]-4,5,6,7-tetrahydrobenzothiophene-3-carboxylic acid methyl ester::2-[[oxo-(1-oxo-3,4-dihydro-1H-2-benzopyran-3-yl)methyl]amino]-4,5,6,7-tetrahydro-1-benzothiophene-3-carboxylic acid methyl ester::MLS000724771::SMR000236924::cid_4906535::methyl 2-[(1-oxidanylidene-3,4-dihydroisochromen-3-yl)carbonylamino]-4,5,6,7-tetrahydro-1-benzothiophene-3-carboxylate::methyl 2-[(1-oxo-3,4-dihydroisochromene-3-carbonyl)amino]-4,5,6,7-tetrahydro-1-benzothiophene-3-carboxylate
SMILES: COC(=O)c1c(NC(=O)C2Cc3ccccc3C(=O)O2)sc2CCCCc12
InChI Key: InChIKey=RZHQKEHUOJBXON-UHFFFAOYSA-N
Data: 2 IC50
Activity Spreadsheet -- Enzyme Inhibition Constant Data from BindingDB
Found 2 hits for monomerid = 80901
Trg + Lig
Ki
nM
ΔG°
kcal/mole
IC50
nM
Kd
nM
EC50/IC50
nM
koff
s-1
kon
M-1s-1
pHTemp
°C
Phospholipase A2
(Homo sapiens (Human))
BDBM80901
(2-[(1-ketoisochroman-3-carbonyl)amino]-4,5,6,7-tet...)
Show SMILES COC(=O)c1c(NC(=O)C2Cc3ccccc3C(=O)O2)sc2CCCCc12
Show InChI InChI=1S/C20H19NO5S/c1-25-20(24)16-13-8-4-5-9-15(13)27-18(16)21-17(22)14-10-11-6-2-3-7-12(11)19(23)26-14/h2-3,6-7,14H,4-5,8-10H2,1H3,(H,21,22)
Reactome pathway
PCBioAssay
n/an/a 1.02E+3n/an/an/an/an/an/a
Burnham Center for Chemical Genomics
Curated by PubChem BioAssay
Assay Description
Data Source: Sanford-Burnham Center for Chemical Genomics (SBCCG) Source Affiliation: Sanford-Burnham Medical Research Institute (SBMRI, San Diego, C...
PubChem Bioassay (2011)
BindingDB Entry DOI: 10.7270/Q26M35BC
cysteine protease ATG4B isoform a
(Homo sapiens (Human))
BDBM80901
(2-[(1-ketoisochroman-3-carbonyl)amino]-4,5,6,7-tet...)
Show SMILES COC(=O)c1c(NC(=O)C2Cc3ccccc3C(=O)O2)sc2CCCCc12
Show InChI InChI=1S/C20H19NO5S/c1-25-20(24)16-13-8-4-5-9-15(13)27-18(16)21-17(22)14-10-11-6-2-3-7-12(11)19(23)26-14/h2-3,6-7,14H,4-5,8-10H2,1H3,(H,21,22)
PCBioAssay
n/an/a 1.62E+3n/an/an/an/an/an/a
Burnham Center for Chemical Genomics
Curated by PubChem BioAssay
Assay Description
Data Source: Sanford-Burnham Center for Chemical Genomics (SBCCG) Source Affiliation: Sanford-Burnham Medical Research Institute (SBMRI, San Diego, C...
PubChem Bioassay (2011)
BindingDB Entry DOI: 10.7270/Q2BZ64H1