null
SMILES: [H][C@@]12CCCC[C@]1([H])CN(C[C@@H](O)[C@H](Cc1ccccc1)NC(=O)[C@@H](CS(=O)c1ccc3ccccc3c1)NS(C)(=O)=O)[C@@H](C2)C(=O)NC(C)(C)C
InChI Key: InChIKey=HSGWMHCBWWNMPP-SRYSGFPJSA-N
Activity Spreadsheet -- Enzyme Inhibition Constant Data from BindingDB
Found 3 hits for monomerid = 810
Trg + Lig
Ki
nM
ΔG°
kcal/mole
IC50
nM
Kd
nM
EC50/IC50
nM
koff
s-1
kon
M-1s-1
pHTemp
°C
Dimer of Gag-Pol polyprotein [489-587]
(Human immunodeficiency virus type 1)
BDBM810
((3S,4aS,8aS)-N-tert-butyl-2-[(2R,3S)-2-hydroxy-3-[...)
Show SMILES [H][C@@]12CCCC[C@]1([H])CN(C[C@@H](O)[C@H](Cc1ccccc1)NC(=O)[C@@H](CS(=O)c1ccc3ccccc3c1)NS(C)(=O)=O)[C@@H](C2)C(=O)NC(C)(C)C |r|
Show InChI InChI=1S/C38H52N4O6S2/c1-38(2,3)40-37(45)34-22-29-16-10-11-17-30(29)23-42(34)24-35(43)32(20-26-12-6-5-7-13-26)39-36(44)33(41-50(4,47)48)25-49(46)31-19-18-27-14-8-9-15-28(27)21-31/h5-9,12-15,18-19,21,29-30,32-35,41,43H,10-11,16-17,20,22-25H2,1-4H3,(H,39,44)(H,40,45)/t29-,30+,32-,33+,34-,35+,49?/m0/s1
n/an/a 0.400n/an/an/an/a5.522
Lilly Research Laboratories
Assay Description
The assay involves the use of a HIV-1 protease peptide substrate which has been modified to contain a biotin moiety on one side and a fluorescent rep...
Bioorg Med Chem Lett 5: 2897-902 (1995)
BindingDB Entry DOI: 10.7270/Q22F7KMG
Gag-Pol polyprotein [489-587]
(Human immunodeficiency virus type 1)
BDBM810
((3S,4aS,8aS)-N-tert-butyl-2-[(2R,3S)-2-hydroxy-3-[...)
Show SMILES [H][C@@]12CCCC[C@]1([H])CN(C[C@@H](O)[C@H](Cc1ccccc1)NC(=O)[C@@H](CS(=O)c1ccc3ccccc3c1)NS(C)(=O)=O)[C@@H](C2)C(=O)NC(C)(C)C |r|
Show InChI InChI=1S/C38H52N4O6S2/c1-38(2,3)40-37(45)34-22-29-16-10-11-17-30(29)23-42(34)24-35(43)32(20-26-12-6-5-7-13-26)39-36(44)33(41-50(4,47)48)25-49(46)31-19-18-27-14-8-9-15-28(27)21-31/h5-9,12-15,18-19,21,29-30,32-35,41,43H,10-11,16-17,20,22-25H2,1-4H3,(H,39,44)(H,40,45)/t29-,30+,32-,33+,34-,35+,49?/m0/s1
n/an/a 0.400n/an/an/an/an/an/a
Lilly Research Laboratories
Assay Description
Inhibitory activity against HIV-1 protease
Bioorg Med Chem Lett 5: 2897-902 (1995)
BindingDB Entry DOI: 10.7270/Q22F7KMG
Gag-Pol polyprotein [489-587]
(Human immunodeficiency virus type 1)
BDBM810
((3S,4aS,8aS)-N-tert-butyl-2-[(2R,3S)-2-hydroxy-3-[...)
Show SMILES [H][C@@]12CCCC[C@]1([H])CN(C[C@@H](O)[C@H](Cc1ccccc1)NC(=O)[C@@H](CS(=O)c1ccc3ccccc3c1)NS(C)(=O)=O)[C@@H](C2)C(=O)NC(C)(C)C |r|
Show InChI InChI=1S/C38H52N4O6S2/c1-38(2,3)40-37(45)34-22-29-16-10-11-17-30(29)23-42(34)24-35(43)32(20-26-12-6-5-7-13-26)39-36(44)33(41-50(4,47)48)25-49(46)31-19-18-27-14-8-9-15-28(27)21-31/h5-9,12-15,18-19,21,29-30,32-35,41,43H,10-11,16-17,20,22-25H2,1-4H3,(H,39,44)(H,40,45)/t29-,30+,32-,33+,34-,35+,49?/m0/s1
0.120n/an/an/an/an/an/an/an/a
Kyoto University
Curated by ChEMBL
Assay Description
Inhibitory activity of the compound against HIV-1 protease
J Med Chem 46: 1764-8 (2003)
Article DOI: 10.1021/jm020537i
BindingDB Entry DOI: 10.7270/Q2805218