BDBM81305 Azole, 10
SMILES: O=C(NCC(c1ccccc1)n1ccnc1)c1cccc(Sc2ccccc2)c1
InChI Key: InChIKey=RHBIMTFFMFPBMJ-UHFFFAOYSA-N
Data: 2 Kd
Activity Spreadsheet -- Enzyme Inhibition Constant Data from BindingDB
Found 2 hits for monomerid = 81305
Trg + Lig
Ki
nM
ΔG°
kcal/mole
IC50
nM
Kd
nM
EC50/IC50
nM
koff
s-1
kon
M-1s-1
pHTemp
°C
Sterol 14-alpha demethylase (CYP51)
(Trypanosoma brucei)
BDBM81305
(Azole, 10)
Show SMILES O=C(NCC(c1ccccc1)n1ccnc1)c1cccc(Sc2ccccc2)c1
Show InChI InChI=1S/C24H21N3OS/c28-24(20-10-7-13-22(16-20)29-21-11-5-2-6-12-21)26-17-23(27-15-14-25-18-27)19-8-3-1-4-9-19/h1-16,18,23H,17H2,(H,26,28)
n/an/an/a 50n/an/an/a6.0n/a
Vanderbilt University
Assay Description
Azole derivatives used as an inhibitor of TB and TC CYP51.
Chem Biol 14: 1283-93 (2007)
Article DOI: 10.1016/j.chembiol.2007.10.011
BindingDB Entry DOI: 10.7270/Q22J69B7
Sterol 14-alpha demethylase (CYP51)
(Trypanosoma cruzi)
BDBM81305
(Azole, 10)
Show SMILES O=C(NCC(c1ccccc1)n1ccnc1)c1cccc(Sc2ccccc2)c1
Show InChI InChI=1S/C24H21N3OS/c28-24(20-10-7-13-22(16-20)29-21-11-5-2-6-12-21)26-17-23(27-15-14-25-18-27)19-8-3-1-4-9-19/h1-16,18,23H,17H2,(H,26,28)
n/an/an/a 50n/an/an/a6.0n/a
Vanderbilt University
Assay Description
Azole derivatives used as an inhibitor of TB and TC CYP51.
Chem Biol 14: 1283-93 (2007)
Article DOI: 10.1016/j.chembiol.2007.10.011
BindingDB Entry DOI: 10.7270/Q22J69B7