BDBM81389 Oxyquinoline, D3, #7
SMILES: COc1ccc(cc1OC)C(NC(=O)Cc1ccccc1)c1ccc2cccnc2c1O
InChI Key: InChIKey=VDNADKRFAFQSPT-UHFFFAOYSA-N
Data: 1 IC50
Activity Spreadsheet -- Enzyme Inhibition Constant Data from BindingDB
Found 1 hit for monomerid = 81389
Trg + Lig
Ki
nM
ΔG°
kcal/mole
IC50
nM
Kd
nM
EC50/IC50
nM
koff
s-1
kon
M-1s-1
pHTemp
°C
Hypoxia-inducible factor 1-alpha
(Homo sapiens (Human))
BDBM81389
(Oxyquinoline, D3, #7)
Show SMILES COc1ccc(cc1OC)C(NC(=O)Cc1ccccc1)c1ccc2cccnc2c1O
Show InChI InChI=1S/C26H24N2O4/c1-31-21-13-11-19(16-22(21)32-2)24(28-23(29)15-17-7-4-3-5-8-17)20-12-10-18-9-6-14-27-25(18)26(20)30/h3-14,16,24,30H,15H2,1-2H3,(H,28,29)
Reactome pathway
n/an/a 2.20E+3n/an/an/an/an/an/a
Weill Medical College of Cornell University
Assay Description
The predication of no specific interaction between enzyme and iron-binding inhibitors but the Enzyme inhibition constants (IC50s)will change in paral...
Chem Biol 17: 380-91 (2010)
Article DOI: 10.1016/j.chembiol.2010.03.008
BindingDB Entry DOI: 10.7270/Q20K271K