BDBM8143 N-[3-bromo-5-(trifluoromethyl)phenyl]-4-{pyrazolo[1,5-a]pyridazin-3-yl}pyrimidin-2-amine::pyrazolo[1,5-b]pyridazine deriv. 34
SMILES: FC(F)(F)c1cc(Br)cc(Nc2nccc(n2)-c2cnn3ncccc23)c1
InChI Key: InChIKey=LVHOFIUXRMSCFN-UHFFFAOYSA-N
Data: 1 KI  3 IC50
Activity Spreadsheet -- Enzyme Inhibition Constant Data from BindingDB
Found 3 hits for monomerid = 8143
Trg + Lig
Ki
nM
ΔG°
kcal/mole
IC50
nM
Kd
nM
EC50/IC50
nM
koff
s-1
kon
M-1s-1
pHTemp
°C
Glycogen synthase kinase-3 beta
(Homo sapiens (Human))
BDBM8143
(N-[3-bromo-5-(trifluoromethyl)phenyl]-4-{pyrazolo[...)
Show SMILES FC(F)(F)c1cc(Br)cc(Nc2nccc(n2)-c2cnn3ncccc23)c1
Show InChI InChI=1S/C17H10BrF3N6/c18-11-6-10(17(19,20)21)7-12(8-11)25-16-22-5-3-14(26-16)13-9-24-27-15(13)2-1-4-23-27/h1-9H,(H,22,25,26)
NCI pathway
Reactome pathway
0.300n/a<10n/an/an/an/an/an/a
GlaxoSmithKline
Assay Description
The biochemical activity of compounds was determined by incubation with specific enzyme and substrate in the presence 2.5 uM ATP/ [gamma-32P] ATP. Af...
J Med Chem 47: 4716-30 (2004)
Article DOI: 10.1021/jm040063i
BindingDB Entry DOI: 10.7270/Q2VM49HJ
Cyclin-Dependent Kinase 4 (CDK4)
(Homo sapiens (Human))
BDBM8143
(N-[3-bromo-5-(trifluoromethyl)phenyl]-4-{pyrazolo[...)
Show SMILES FC(F)(F)c1cc(Br)cc(Nc2nccc(n2)-c2cnn3ncccc23)c1
Show InChI InChI=1S/C17H10BrF3N6/c18-11-6-10(17(19,20)21)7-12(8-11)25-16-22-5-3-14(26-16)13-9-24-27-15(13)2-1-4-23-27/h1-9H,(H,22,25,26)
NCI pathway
Reactome pathway
n/an/a 251n/an/an/an/an/an/a
GlaxoSmithKline
Assay Description
The biochemical activity of compounds was determined by incubation with specific enzyme and substrate in the presence 2.5 uM ATP/ [gamma-32P] ATP. Af...
J Med Chem 47: 4716-30 (2004)
Article DOI: 10.1021/jm040063i
BindingDB Entry DOI: 10.7270/Q2VM49HJ
Cyclin-Dependent Kinase 2 (CDK2)
(Homo sapiens (Human))
BDBM8143
(N-[3-bromo-5-(trifluoromethyl)phenyl]-4-{pyrazolo[...)
Show SMILES FC(F)(F)c1cc(Br)cc(Nc2nccc(n2)-c2cnn3ncccc23)c1
Show InChI InChI=1S/C17H10BrF3N6/c18-11-6-10(17(19,20)21)7-12(8-11)25-16-22-5-3-14(26-16)13-9-24-27-15(13)2-1-4-23-27/h1-9H,(H,22,25,26)
NCI pathway
Reactome pathway
n/an/a 12n/an/an/an/an/an/a
GlaxoSmithKline
Assay Description
The biochemical activity of compounds was determined by incubation with specific enzyme and substrate in the presence 2.5 uM ATP/ [gamma-32P] ATP. Af...
J Med Chem 47: 4716-30 (2004)
Article DOI: 10.1021/jm040063i
BindingDB Entry DOI: 10.7270/Q2VM49HJ