BDBM8145 N-(3,5-dichlorophenyl)-4-{pyrazolo[1,5-a]pyridazin-3-yl}pyrimidin-2-amine::pyrazolo[1,5-b]pyridazine deriv. 36
SMILES: Clc1cc(Cl)cc(Nc2nccc(n2)-c2cnn3ncccc23)c1
InChI Key: InChIKey=KIJWMPSSOUHQTQ-UHFFFAOYSA-N
Data: 1 KI  3 IC50
Activity Spreadsheet -- Enzyme Inhibition Constant Data from BindingDB
Found 3 hits for monomerid = 8145
Trg + Lig
Ki
nM
ΔG°
kcal/mole
IC50
nM
Kd
nM
EC50/IC50
nM
koff
s-1
kon
M-1s-1
pHTemp
°C
Glycogen synthase kinase-3 beta
(Homo sapiens (Human))
BDBM8145
(N-(3,5-dichlorophenyl)-4-{pyrazolo[1,5-a]pyridazin...)
Show SMILES Clc1cc(Cl)cc(Nc2nccc(n2)-c2cnn3ncccc23)c1
Show InChI InChI=1S/C16H10Cl2N6/c17-10-6-11(18)8-12(7-10)22-16-19-5-3-14(23-16)13-9-21-24-15(13)2-1-4-20-24/h1-9H,(H,19,22,23)
NCI pathway
Reactome pathway
1n/a<10n/an/an/an/an/an/a
GlaxoSmithKline
Assay Description
The biochemical activity of compounds was determined by incubation with specific enzyme and substrate in the presence 2.5 uM ATP/ [gamma-32P] ATP. Af...
J Med Chem 47: 4716-30 (2004)
Article DOI: 10.1021/jm040063i
BindingDB Entry DOI: 10.7270/Q2VM49HJ
Cyclin-Dependent Kinase 4 (CDK4)
(Homo sapiens (Human))
BDBM8145
(N-(3,5-dichlorophenyl)-4-{pyrazolo[1,5-a]pyridazin...)
Show SMILES Clc1cc(Cl)cc(Nc2nccc(n2)-c2cnn3ncccc23)c1
Show InChI InChI=1S/C16H10Cl2N6/c17-10-6-11(18)8-12(7-10)22-16-19-5-3-14(23-16)13-9-21-24-15(13)2-1-4-20-24/h1-9H,(H,19,22,23)
NCI pathway
Reactome pathway
n/an/a 1.99E+3n/an/an/an/an/an/a
GlaxoSmithKline
Assay Description
The biochemical activity of compounds was determined by incubation with specific enzyme and substrate in the presence 2.5 uM ATP/ [gamma-32P] ATP. Af...
J Med Chem 47: 4716-30 (2004)
Article DOI: 10.1021/jm040063i
BindingDB Entry DOI: 10.7270/Q2VM49HJ
Cyclin-Dependent Kinase 2 (CDK2)
(Homo sapiens (Human))
BDBM8145
(N-(3,5-dichlorophenyl)-4-{pyrazolo[1,5-a]pyridazin...)
Show SMILES Clc1cc(Cl)cc(Nc2nccc(n2)-c2cnn3ncccc23)c1
Show InChI InChI=1S/C16H10Cl2N6/c17-10-6-11(18)8-12(7-10)22-16-19-5-3-14(23-16)13-9-21-24-15(13)2-1-4-20-24/h1-9H,(H,19,22,23)
NCI pathway
Reactome pathway
n/an/a 316n/an/an/an/an/an/a
GlaxoSmithKline
Assay Description
The biochemical activity of compounds was determined by incubation with specific enzyme and substrate in the presence 2.5 uM ATP/ [gamma-32P] ATP. Af...
J Med Chem 47: 4716-30 (2004)
Article DOI: 10.1021/jm040063i
BindingDB Entry DOI: 10.7270/Q2VM49HJ