BDBM81563 Magreth-16a
SMILES: CCOc1ccc(CC=C)cc1-c1ccc(O)c(CC=C)c1
InChI Key: InChIKey=WSNYCJWIVUTQGA-UHFFFAOYSA-N
Data: 2 KI  1 EC50
Activity Spreadsheet -- Enzyme Inhibition Constant Data from BindingDB
Found 3 hits for monomerid = 81563
Trg + Lig
Ki
nM
ΔG°
kcal/mole
IC50
nM
Kd
nM
EC50/IC50
nM
koff
s-1
kon
M-1s-1
pHTemp
°C
Cannabinoid receptor 2
(Homo sapiens (Human))
BDBM81563
(Magreth-16a)
Show SMILES CCOc1ccc(CC=C)cc1-c1ccc(O)c(CC=C)c1
Show InChI InChI=1S/C20H22O2/c1-4-7-15-9-12-20(22-6-3)18(13-15)16-10-11-19(21)17(14-16)8-5-2/h4-5,9-14,21H,1-2,6-8H2,3H3
Reactome pathway
51n/an/an/an/an/an/an/an/a
University of Bern
Assay Description
Binding assay with hCB1 and hCB2 receptors.
Chem Biol 18: 1053-64 (2011)
Article DOI: 10.1016/j.chembiol.2011.05.012
BindingDB Entry DOI: 10.7270/Q27W69PQ
Cannabinoid receptor 1
(Homo sapiens (Human))
BDBM81563
(Magreth-16a)
Show SMILES CCOc1ccc(CC=C)cc1-c1ccc(O)c(CC=C)c1
Show InChI InChI=1S/C20H22O2/c1-4-7-15-9-12-20(22-6-3)18(13-15)16-10-11-19(21)17(14-16)8-5-2/h4-5,9-14,21H,1-2,6-8H2,3H3
NCI pathway
Reactome pathway
1.23E+3n/an/an/an/an/an/an/an/a
University of Bern
Assay Description
Binding assay with hCB1 and hCB2 receptors.
Chem Biol 18: 1053-64 (2011)
Article DOI: 10.1016/j.chembiol.2011.05.012
BindingDB Entry DOI: 10.7270/Q27W69PQ
GABA-A receptor; GABA-A site (alpha1/beta2 interface)
(Homo sapiens (Human))
BDBM81563
(Magreth-16a)
Show SMILES CCOc1ccc(CC=C)cc1-c1ccc(O)c(CC=C)c1
Show InChI InChI=1S/C20H22O2/c1-4-7-15-9-12-20(22-6-3)18(13-15)16-10-11-19(21)17(14-16)8-5-2/h4-5,9-14,21H,1-2,6-8H2,3H3
n/an/an/an/a 1.43E+4n/an/an/an/a
University of Vienna
Curated by ChEMBL
Assay Description
Modulation of GABA Aalpha1beta2 receptor expressed in Xenopus laevis oocytes assessed as potentiation of GABA-induced chloride current at holding pot...
J Med Chem 54: 5349-61 (2011)
Article DOI: 10.1021/jm200186n
BindingDB Entry DOI: 10.7270/Q2QR4XGP