BDBM81693 4-Substituted Pyrrolidine Ring, 16::4-Substituted Pyrrolidine Ring, 17
SMILES: CS(=O)(=O)c1ccccc1-c1ccc(NC(=O)[C@H]2CC(F)CN2C(=O)Nc2ccc(Cl)cc2)c(F)c1
InChI Key: InChIKey=NXKSHXRRVMZPFR-IVAFLUGOSA-N
Data: 2 IC50
Activity Spreadsheet -- Enzyme Inhibition Constant Data from BindingDB
Found 2 hits for monomerid = 81693
Trg + Lig
Ki
nM
ΔG°
kcal/mole
IC50
nM
Kd
nM
EC50/IC50
nM
koff
s-1
kon
M-1s-1
pHTemp
°C
Coagulation factor X
(Homo sapiens (Human))
BDBM81693
(4-Substituted Pyrrolidine Ring, 16 | 4-Substituted...)
Show SMILES CS(=O)(=O)c1ccccc1-c1ccc(NC(=O)[C@H]2CC(F)CN2C(=O)Nc2ccc(Cl)cc2)c(F)c1 |r|
Show InChI InChI=1S/C25H22ClF2N3O4S/c1-36(34,35)23-5-3-2-4-19(23)15-6-11-21(20(28)12-15)30-24(32)22-13-17(27)14-31(22)25(33)29-18-9-7-16(26)8-10-18/h2-12,17,22H,13-14H2,1H3,(H,29,33)(H,30,32)/t17?,22-/m1/s1
Reactome pathway
n/an/a 1.20n/an/an/an/an/an/a
Pfizer Global Research and Development,
Assay Description
FXa inhibition were determined by using an inhibition assay.
Chem Biol Drug Des 69: 444-50 (2007)
Article DOI: 10.1111/j.1747-0285.2007.00520.x
BindingDB Entry DOI: 10.7270/Q2PZ5799
Coagulation factor X
(Homo sapiens (Human))
BDBM81693
(4-Substituted Pyrrolidine Ring, 16 | 4-Substituted...)
Show SMILES CS(=O)(=O)c1ccccc1-c1ccc(NC(=O)[C@H]2CC(F)CN2C(=O)Nc2ccc(Cl)cc2)c(F)c1 |r|
Show InChI InChI=1S/C25H22ClF2N3O4S/c1-36(34,35)23-5-3-2-4-19(23)15-6-11-21(20(28)12-15)30-24(32)22-13-17(27)14-31(22)25(33)29-18-9-7-16(26)8-10-18/h2-12,17,22H,13-14H2,1H3,(H,29,33)(H,30,32)/t17?,22-/m1/s1
Reactome pathway
n/an/a 7n/an/an/an/an/an/a
Pfizer Global Research and Development,
Assay Description
FXa inhibition were determined by using an inhibition assay.
Chem Biol Drug Des 69: 444-50 (2007)
Article DOI: 10.1111/j.1747-0285.2007.00520.x
BindingDB Entry DOI: 10.7270/Q2PZ5799