BDBM82116 1,3,5-Triazaspiro[5.5]undeca-1,3-diene-2,4-diamine, IIe::CHEMBL1800946
SMILES: NC1=NC2(CCCCC2)N(OCCCOc2ccccc2)C(N)=N1
InChI Key: InChIKey=SKLBDXCGGPLAAM-UHFFFAOYSA-N
Data: 2 IC50
Activity Spreadsheet -- Enzyme Inhibition Constant Data from BindingDB
Found 2 hits for monomerid = 82116
Trg + Lig
Ki
nM
ΔG°
kcal/mole
IC50
nM
Kd
nM
EC50/IC50
nM
koff
s-1
kon
M-1s-1
pHTemp
°C
Dihydrofolate reductase (DHFR)
(Bos taurus (Cattle))
BDBM82116
(1,3,5-Triazaspiro[5.5]undeca-1,3-diene-2,4-diamine...)
Show SMILES NC1=NC2(CCCCC2)N(OCCCOc2ccccc2)C(N)=N1 |c:24,t:1|
Show InChI InChI=1S/C17H25N5O2/c18-15-20-16(19)22(17(21-15)10-5-2-6-11-17)24-13-7-12-23-14-8-3-1-4-9-14/h1,3-4,8-9H,2,5-7,10-13H2,(H4,18,19,20,21)
n/an/a 6.90n/an/an/an/an/an/a
National University of Singapore
Curated by ChEMBL
Assay Description
Inhibition of bovine liver DHFR using dihydrofolic acid substrate by UV-visible spectrophotometry
Bioorg Med Chem 18: 737-43 (2010)
Article DOI: 10.1016/j.bmc.2009.11.065
BindingDB Entry DOI: 10.7270/Q28C9X7M
Dihydrofolate reductase (DHFR)
(Bos taurus (Cattle))
BDBM82116
(1,3,5-Triazaspiro[5.5]undeca-1,3-diene-2,4-diamine...)
Show SMILES NC1=NC2(CCCCC2)N(OCCCOc2ccccc2)C(N)=N1 |c:24,t:1|
Show InChI InChI=1S/C17H25N5O2/c18-15-20-16(19)22(17(21-15)10-5-2-6-11-17)24-13-7-12-23-14-8-3-1-4-9-14/h1,3-4,8-9H,2,5-7,10-13H2,(H4,18,19,20,21)
n/an/a 6.90n/an/an/an/an/an/a
National University of Singapore
Assay Description
Inhibition activity using bovine dihydrofolate reductase (DHFR).
Chem Biol Drug Des 74: 322-6 (2009)
Article DOI: 10.1111/j.1747-0285.2009.00860.x
BindingDB Entry DOI: 10.7270/Q24F1P74