null
SMILES: [H][C@]12CCS[C@@]1([H])C[C@H](N(C[C@@H](O)[C@H](Cc1ccccc1)NC(=O)[C@@H](CS(=O)(=O)c1cccc3cccnc13)NC(=O)C(F)(F)F)C2)C(=O)NC(C)(C)C
InChI Key: InChIKey=GPEVFYOHNNRULA-IFZRAKSQSA-N
Activity Spreadsheet -- Enzyme Inhibition Constant Data from BindingDB
Found 2 hits for monomerid = 825
Trg + Lig
Ki
nM
ΔG°
kcal/mole
IC50
nM
Kd
nM
EC50/IC50
nM
koff
s-1
kon
M-1s-1
pHTemp
°C
Gag-Pol polyprotein [489-587]
(Human immunodeficiency virus type 1)
BDBM825
((3aR,6S,7aS)-N-tert-butyl-5-[(2R,3S)-2-hydroxy-4-p...)
Show SMILES [H][C@]12CCS[C@@]1([H])C[C@H](N(C[C@@H](O)[C@H](Cc1ccccc1)NC(=O)[C@@H](CS(=O)(=O)c1cccc3cccnc13)NC(=O)C(F)(F)F)C2)C(=O)NC(C)(C)C |r|
Show InChI InChI=1S/C36H44F3N5O6S2/c1-35(2,3)43-33(47)27-18-29-24(14-16-51-29)19-44(27)20-28(45)25(17-22-9-5-4-6-10-22)41-32(46)26(42-34(48)36(37,38)39)21-52(49,50)30-13-7-11-23-12-8-15-40-31(23)30/h4-13,15,24-29,45H,14,16-21H2,1-3H3,(H,41,46)(H,42,48)(H,43,47)/t24-,25+,26-,27+,28-,29+/m1/s1
n/an/a 0.210n/an/an/an/an/an/a
Lilly Research Laboratories
Assay Description
Inhibitory activity against HIV-1 protease
Bioorg Med Chem Lett 5: 2897-902 (1995)
BindingDB Entry DOI: 10.7270/Q22F7KMG
Dimer of Gag-Pol polyprotein [489-587]
(Human immunodeficiency virus type 1)
BDBM825
((3aR,6S,7aS)-N-tert-butyl-5-[(2R,3S)-2-hydroxy-4-p...)
Show SMILES [H][C@]12CCS[C@@]1([H])C[C@H](N(C[C@@H](O)[C@H](Cc1ccccc1)NC(=O)[C@@H](CS(=O)(=O)c1cccc3cccnc13)NC(=O)C(F)(F)F)C2)C(=O)NC(C)(C)C |r|
Show InChI InChI=1S/C36H44F3N5O6S2/c1-35(2,3)43-33(47)27-18-29-24(14-16-51-29)19-44(27)20-28(45)25(17-22-9-5-4-6-10-22)41-32(46)26(42-34(48)36(37,38)39)21-52(49,50)30-13-7-11-23-12-8-15-40-31(23)30/h4-13,15,24-29,45H,14,16-21H2,1-3H3,(H,41,46)(H,42,48)(H,43,47)/t24-,25+,26-,27+,28-,29+/m1/s1
n/an/a 0.210n/an/an/an/a5.522
Lilly Research Laboratories
Assay Description
The assay involves the use of a HIV-1 protease peptide substrate which has been modified to contain a biotin moiety on one side and a fluorescent rep...
Bioorg Med Chem Lett 5: 2897-902 (1995)
BindingDB Entry DOI: 10.7270/Q22F7KMG