null
SMILES: CC(C)OCCOc1ccc2oc(cc(=O)c2c1)-c1ccco1
InChI Key: InChIKey=CQVHTRQSNKZBCC-UHFFFAOYSA-N
Activity Spreadsheet -- Enzyme Inhibition Constant Data from BindingDB
Found 2 hits for monomerid = 82911
Trg + Lig
Ki
nM
ΔG°
kcal/mole
IC50
nM
Kd
nM
EC50/IC50
nM
koff
s-1
kon
M-1s-1
pHTemp
°C
Kallikrein-7
(Homo sapiens (Human))
BDBM82911
(2-(2-furanyl)-6-(2-propan-2-yloxyethoxy)-1-benzopy...)
Show SMILES CC(C)OCCOc1ccc2oc(cc(=O)c2c1)-c1ccco1
Show InChI InChI=1S/C18H18O5/c1-12(2)20-8-9-21-13-5-6-16-14(10-13)15(19)11-18(23-16)17-4-3-7-22-17/h3-7,10-12H,8-9H2,1-2H3
Reactome pathway
PCBioAssay
n/an/an/an/a>7.72E+3n/an/an/an/a
The Scripps Research Institute Molecular Screening Center
Curated by PubChem BioAssay
PubChem Bioassay (2013)
BindingDB Entry DOI: 10.7270/Q29G5KF0
Carboxy-terminal domain RNA polymerase II polypeptide A small phosphatase 1
(Homo sapiens (Human))
BDBM82911
(2-(2-furanyl)-6-(2-propan-2-yloxyethoxy)-1-benzopy...)
Show SMILES CC(C)OCCOc1ccc2oc(cc(=O)c2c1)-c1ccco1
Show InChI InChI=1S/C18H18O5/c1-12(2)20-8-9-21-13-5-6-16-14(10-13)15(19)11-18(23-16)17-4-3-7-22-17/h3-7,10-12H,8-9H2,1-2H3
PCBioAssay
n/an/a 2.17E+4n/an/an/an/an/an/a
Burnham Center for Chemical Genomics
Curated by PubChem BioAssay
Assay Description
Data Source: Sanford-Burnham Center for Chemical Genomics (SBCCG) Source Affiliation: Sanford-Burnham Medical Research Institute (SBMRI, San Diego, C...
PubChem Bioassay (2011)
BindingDB Entry DOI: 10.7270/Q2V986KM